Skip site navigation (1)Skip section navigation (2)
Date:      Tue, 15 Oct 2013 10:06:46 +0300
From:      Juris Kaminskis <juris.kaminskis@gmail.com>
To:        freebsd-questions@freebsd.org
Subject:   Neither webkit-gtk2 or webkit-gtk3 builds on my machine
Message-ID:  <CAKJAkztawUcJa6fr4Yc5wA+=9+3TjRvYr4MuC+Uku_eTNz67Kw@mail.gmail.com>
In-Reply-To: <CAKJAkzs4Q7ORMtCWrymxLuHa8rpxncEKWsLrBbs7yXBPdsm3tQ@mail.gmail.com>
References:  <CAKJAkzs4Q7ORMtCWrymxLuHa8rpxncEKWsLrBbs7yXBPdsm3tQ@mail.gmail.com>

Next in thread | Previous in thread | Raw E-Mail | Index | Archive | Help
Hello

Was trying to send this message to freebsd-gnome, but probably it is more
related to freebsd-questions.

I have built freebsd-current and want to install webkit-gtk2. My uname -a
  FreeBSD station 10.0-ALPHA4 FreeBSD 10.0-ALPHA4 #0 r256063: Sat Oct  5
23:04:45 EEST 2013     root@station:/usr/obj/usr/src/sys/GENERIC  amd64

When I try to compile and adding in /etc/make.conf MAKE_JOBS_UNSAFE

I get build error any help?

 Execute: '(cd /usr/ports/www/webkit-gtk3/work/webkit-1.8.3; if !
/usr/bin/env SHELL=/bin/sh NO_LINT=YES   LIBTOOL=/usr/local/bin/libtool
LIBTOOLIZE=/usr/local/bin/libtoolize
LIBTOOL_LIBEXECDIR=/usr/local/libexec/libtool
LIBTOOL_SHAREDIR=/usr/local/share/libtool
LIBTOOL_M4=/usr/local/share/aclocal/libtool.m4
LTMAIN=/usr/local/share/libtool/config/ltmain.sh GI_SCANNER_DISABLE_CACHE=1
PREFIX=/usr/local  LOCALBASE=/usr/local  LIBDIR="/usr/lib"  CC="cc"
CFLAGS="-O2 -pipe -fno-strict-aliasing"  CPP="cpp"
CPPFLAGS="-I/usr/local/include -Wno-c++11-extensions"  LDFLAGS="
-L/usr/local/lib"  CXX="c++" CXXFLAGS="-O2 -pipe -fno-strict-aliasing"
MANPREFIX="/usr/local" BSD_INSTALL_PROGRAM="install  -s -o root -g wheel -m
555"  BSD_INSTALL_LIB="install  -s -o root -g wheel -m 444"
BSD_INSTALL_SCRIPT="install  -o root -g wheel -m 555"
BSD_INSTALL_DATA="install  -o root -g wheel -m 444"
BSD_INSTALL_MAN="install  -o root -g wheel -m 444" gmake -f GNUmakefile
DESTDIR=/usr/ports/www/webkit-gtk3/work/stage all; then  if [ -n "" ] ;
then  echo "===> Compilation failed unexpectedly.";  (echo "") |
/usr/bin/fmt 75 79 ;  fi;  false;  fi)'
+ cd /usr/ports/www/webkit-gtk3/work/webkit-1.8.3
+ /usr/bin/env SHELL=/bin/sh NO_LINT=YES LIBTOOL=/usr/local/bin/libtool
LIBTOOLIZE=/usr/local/bin/libtoolize
LIBTOOL_LIBEXECDIR=/usr/local/libexec/libtool
LIBTOOL_SHAREDIR=/usr/local/share/libtool
LIBTOOL_M4=/usr/local/share/aclocal/libtool.m4
LTMAIN=/usr/local/share/libtool/config/ltmain.sh GI_SCANNER_DISABLE_CACHE=1
PREFIX=/usr/local LOCALBASE=/usr/local LIBDIR=/usr/lib CC=cc 'CFLAGS=-O2
-pipe -fno-strict-aliasing' CPP=cpp 'CPPFLAGS=-I/usr/local/include
-Wno-c++11-extensions' 'LDFLAGS= -L/usr/local/lib' CXX=c++ 'CXXFLAGS=-O2
-pipe -fno-strict-aliasing' MANPREFIX=/usr/local
'BSD_INSTALL_PROGRAM=install  -s -o root -g wheel -m 555'
'BSD_INSTALL_LIB=install  -s -o root -g wheel -m 444'
'BSD_INSTALL_SCRIPT=install  -o root -g wheel -m 555'
'BSD_INSTALL_DATA=install  -o root -g wheel -m 444'
'BSD_INSTALL_MAN=install  -o root -g wheel -m 444' gmake -f GNUmakefile
DESTDIR=/usr/ports/www/webkit-gtk3/work/stage all
/usr/bin/ld: warning: libpixman-1.so.9, needed by /usr/local/lib/
libpangocairo-1.0.so, may conflict with libpixman-1.so.30
./.libs/libwebkitgtk-3.0.so: undefined reference to
`std::__1::basic_streambuf<char, std::__1::char_traits<char>
>::basic_streambuf()'
./.libs/libwebkitgtk-3.0.so: undefined reference to
`std::__1::ios_base::getloc() const'
./.libs/libwebkitgtk-3.0.so: undefined reference to
`std::__1::basic_string<char, std::__1::char_traits<char>,
std::__1::allocator<char> >::basic_string(std::__1::basic_string<char,
std::__1::char_traits<char>, std::__1::allocator<char> > const&)'
./.libs/libwebkitgtk-3.0.so: undefined reference to
`std::__1::ios_base::imbue(std::__1::locale const&)'
./.libs/libwebkitgtk-3.0.so: undefined reference to
`std::__1::basic_string<char, std::__1::char_traits<char>,
std::__1::allocator<char> >::append(char const*, unsigned long)'
./.libs/libwebkitgtk-3.0.so: undefined reference to
`std::__1::basic_streambuf<char, std::__1::char_traits<char> >::xsputn(char
const*, long)'
./.libs/libwebkitgtk-3.0.so: undefined reference to
`std::__1::__basic_string_common<true>::__throw_length_error() const'
./.libs/libwebkitgtk-3.0.so: undefined reference to
`std::__1::locale::use_facet(std::__1::locale::id&) const'
./.libs/libwebkitgtk-3.0.so: undefined reference to
`std::__1::basic_ostream<char, std::__1::char_traits<char>
>::sentry::sentry(std::__1::basic_ostream<char, std::__1::char_traits<char>
>&)'
./.libs/libwebkitgtk-3.0.so: undefined reference to
`std::__1::locale::operator=(std::__1::locale const&)'
./.libs/libwebkitgtk-3.0.so: undefined reference to
`std::__1::basic_ostream<char, std::__1::char_traits<char>
>::~basic_ostream()'
./.libs/libwebkitgtk-3.0.so: undefined reference to
`std::__1::basic_ostream<char, std::__1::char_traits<char>
>::operator<<(float)'
./.libs/libwebkitgtk-3.0.so: undefined reference to
`std::__1::basic_ostream<char, std::__1::char_traits<char>
>::sentry::~sentry()'
./.libs/libwebkitgtk-3.0.so: undefined reference to
`std::__1::basic_string<char, std::__1::char_traits<char>,
std::__1::allocator<char> >::push_back(char)'
./.libs/libwebkitgtk-3.0.so: undefined reference to
`std::__1::basic_string<char, std::__1::char_traits<char>,
std::__1::allocator<char> >::assign(char const*)'
./.libs/libwebkitgtk-3.0.so: undefined reference to
`std::__1::basic_streambuf<char, std::__1::char_traits<char> >::uflow()'
./.libs/libwebkitgtk-3.0.so: undefined reference to
`std::__1::basic_ostream<char, std::__1::char_traits<char>
>::~basic_ostream()'
./.libs/libwebkitgtk-3.0.so: undefined reference to
`std::__1::locale::locale(char const*)'
./.libs/libwebkitgtk-3.0.so: undefined reference to
`std::__1::basic_ostream<char, std::__1::char_traits<char>
>::~basic_ostream()'
./.libs/libwebkitgtk-3.0.so: undefined reference to
`std::__1::basic_streambuf<char, std::__1::char_traits<char>
>::setbuf(char*, long)'
./.libs/libwebkitgtk-3.0.so: undefined reference to
`std::__1::basic_streambuf<char, std::__1::char_traits<char>
>::imbue(std::__1::locale const&)'
./.libs/libwebkitgtk-3.0.so: undefined reference to
`std::__1::basic_string<char, std::__1::char_traits<char>,
std::__1::allocator<char> >::~basic_string()'
./.libs/libwebkitgtk-3.0.so: undefined reference to
`std::__1::basic_streambuf<char, std::__1::char_traits<char> >::sync()'
./.libs/libwebkitgtk-3.0.so: undefined reference to
`std::__1::__basic_string_common<true>::__throw_out_of_range() const'
./.libs/libwebkitgtk-3.0.so: undefined reference to
`std::__1::basic_string<char, std::__1::char_traits<char>,
std::__1::allocator<char> >::append(char const*)'
./.libs/libwebkitgtk-3.0.so: undefined reference to
`std::__1::__vector_base_common<true>::__throw_length_error() const'
./.libs/libwebkitgtk-3.0.so: undefined reference to
`std::__1::basic_string<char, std::__1::char_traits<char>,
std::__1::allocator<char> >::resize(unsigned long, char)'
./.libs/libwebkitgtk-3.0.so: undefined reference to `virtual thunk to
std::__1::basic_istream<char, std::__1::char_traits<char>
>::~basic_istream()'
./.libs/libwebkitgtk-3.0.so: undefined reference to
`std::__1::locale::~locale()'
./.libs/libwebkitgtk-3.0.so: undefined reference to
`std::__1::basic_istream<char, std::__1::char_traits<char>
>::operator>>(double&)'
./.libs/libwebkitgtk-3.0.so: undefined reference to
`std::__1::ios_base::clear(unsigned int)'
./.libs/libwebkitgtk-3.0.so: undefined reference to
`std::__1::basic_ostream<char, std::__1::char_traits<char>
>::operator<<(int)'
./.libs/libwebkitgtk-3.0.so: undefined reference to
`std::__1::basic_string<char, std::__1::char_traits<char>,
std::__1::allocator<char> >::__init(unsigned long, char)'
./.libs/libwebkitgtk-3.0.so: undefined reference to
`std::__1::basic_string<char, std::__1::char_traits<char>,
std::__1::allocator<char> >::operator=(std::__1::basic_string<char,
std::__1::char_traits<char>, std::__1::allocator<char> > const&)'
./.libs/libwebkitgtk-3.0.so: undefined reference to
`std::__1::basic_istream<char, std::__1::char_traits<char>
>::~basic_istream()'
./.libs/libwebkitgtk-3.0.so: undefined reference to `virtual thunk to
std::__1::basic_ostream<char, std::__1::char_traits<char>
>::~basic_ostream()'
./.libs/libwebkitgtk-3.0.so: undefined reference to
`std::__1::basic_ios<char, std::__1::char_traits<char> >::~basic_ios()'
./.libs/libwebkitgtk-3.0.so: undefined reference to `void
std::__1::__sort<std::__1::__less<unsigned int, unsigned int>&, unsigned
int*>(unsigned int*, unsigned int*, std::__1::__less<unsigned int, unsigned
int>&)'
./.libs/libwebkitgtk-3.0.so: undefined reference to
`std::__1::basic_streambuf<char, std::__1::char_traits<char>
>::xsgetn(char*, long)'
./.libs/libwebkitgtk-3.0.so: undefined reference to
`std::__1::basic_streambuf<char, std::__1::char_traits<char> >::showmanyc()'
./.libs/libwebkitgtk-3.0.so: undefined reference to
`std::__1::basic_istream<char, std::__1::char_traits<char>
>::~basic_istream()'
./.libs/libwebkitgtk-3.0.so: undefined reference to
`std::__1::locale::locale(std::__1::locale const&)'
./.libs/libwebkitgtk-3.0.so: undefined reference to
`std::__1::ios_base::init(void*)'
./.libs/libwebkitgtk-3.0.so: undefined reference to `void
std::__1::__sort<std::__1::__less<int, int>&, int*>(int*, int*,
std::__1::__less<int, int>&)'
./.libs/libwebkitgtk-3.0.so: undefined reference to
`std::__1::basic_istream<char, std::__1::char_traits<char>
>::~basic_istream()'
./.libs/libwebkitgtk-3.0.so: undefined reference to `virtual thunk to
std::__1::basic_istream<char, std::__1::char_traits<char>
>::~basic_istream()'
./.libs/libwebkitgtk-3.0.so: undefined reference to
`std::__1::basic_streambuf<char, std::__1::char_traits<char>
>::~basic_streambuf()'
./.libs/libwebkitgtk-3.0.so: undefined reference to
`std::__1::ctype<char>::id'
./.libs/libwebkitgtk-3.0.so: undefined reference to `virtual thunk to
std::__1::basic_ostream<char, std::__1::char_traits<char>
>::~basic_ostream()'
./.libs/libwebkitgtk-3.0.so: undefined reference to
`std::__1::basic_string<char, std::__1::char_traits<char>,
std::__1::allocator<char> >::__init(char const*, unsigned long)'
cc: error: linker command failed with exit code 1 (use -v to see invocation)
gmake[3]: *** [Programs/unittests/testapplicationcache] Error 1
gmake[2]: *** [all] Error 2
+ [ -n '' ]
+ false

*** Failed target:  do-build
*** Failed command: (cd /usr/ports/www/webkit-gtk3/work/webkit-1.8.3; if !
/usr/bin/env SHELL=/bin/sh NO_LINT=YES LIBTOOL=/usr/local/bin/libtool
LIBTOOLIZE=/usr/local/bin/libtoolize
LIBTOOL_LIBEXECDIR=/usr/local/libexec/libtool
LIBTOOL_SHAREDIR=/usr/local/share/libtool
LIBTOOL_M4=/usr/local/share/aclocal/libtool.m4
LTMAIN=/usr/local/share/libtool/config/ltmain.sh GI_SCANNER_DISABLE_CACHE=1
PREFIX=/usr/local LOCALBASE=/usr/local LIBDIR="/usr/lib" CC="cc"
CFLAGS="-O2 -pipe -fno-strict-aliasing" CPP="cpp"
CPPFLAGS="-I/usr/local/include -Wno-c++11-extensions" LDFLAGS="
-L/usr/local/lib" CXX="c++" CXXFLAGS="-O2 -pipe -fno-strict-aliasing"
MANPREFIX="/usr/local" BSD_INSTALL_PROGRAM="install -s -o root -g wheel -m
555" BSD_INSTALL_LIB="install -s -o root -g wheel -m 444"
BSD_INSTALL_SCRIPT="install -o root -g wheel -m 555"
BSD_INSTALL_DATA="install -o root -g wheel -m 444" BSD_INSTALL_MAN="install
-o root -g wheel -m 444" gmake -f GNUmakefile
DESTDIR=/usr/ports/www/webkit-gtk3/work/stage all; then if [ -n "" ] ; then
echo "===> Compilation failed unexpectedly."; (echo "") | /usr/bin/fmt 75
79 ; fi; false; fi)
Global:.ERROR_TARGET = do-build
Applying[MAKE_PRINT_VAR_ON_ERROR] :@ to ""
Modifier pattern: "v"
Modifier pattern: "$v='${$v}'
"
Result[MAKE_PRINT_VAR_ON_ERROR] of :@ is ""

*** Failed target:  install
*** Failed command: cd /usr/ports/www/webkit-gtk3 && make
CONFIG_DONE_WEBKIT=1
/usr/ports/www/webkit-gtk3/work/.install_done.webkit._usr_local
Global:.ERROR_TARGET = install
Applying[MAKE_PRINT_VAR_ON_ERROR] :@ to ""
Modifier pattern: "v"
Modifier pattern: "$v='${$v}'
"
Result[MAKE_PRINT_VAR_ON_ERROR] of :@ is ""

--------------------

i have upgraded all ports, everything is ok, pkgdb -F does not give any
errors and is succesfull

thanks
juris



Want to link to this message? Use this URL: <http://docs.FreeBSD.org/cgi/mid.cgi?CAKJAkztawUcJa6fr4Yc5wA+=9+3TjRvYr4MuC+Uku_eTNz67Kw>