Skip site navigation (1)Skip section navigation (2)
Date:      Thu, 21 Apr 2011 11:17:52 -0400
From:      Lowell Gilbert <freebsd-questions-local@be-well.ilk.org>
To:        =?gb2312?B?p6Sn5afdp/Gn1qfTIKekp+Cn6qfR?= <gosha-necr@yandex.ru>
Cc:        freebsd-questions@freebsd.org
Subject:   Re: libreoffice not builds (sorry for codepage problem)
Message-ID:  <44bozziqfz.fsf@lowell-desk.lan>
In-Reply-To: <1038171303320281@web105.yandex.ru> (=?gb2312?B?Iqekp+Wn3afx?= =?gb2312?B?p9an0yCnpKfgp+qn0SIncw==?= message of "Wed, 20 Apr 2011 21:24:40 +0400")
References:  <1038171303320281@web105.yandex.ru>

Next in thread | Previous in thread | Raw E-Mail | Index | Archive | Help
=A7=A4=A7=E5=A7=DD=A7=F1=A7=D6=A7=D3 =A7=A4=A7=E0=A7=EA=A7=D1 <gosha-necr@y=
andex.ru> writes:

> Hi all! I'm try to install editors/libreoffice on my machine:
> OS: 8.2-STABLE FreeBSD 8.2-STABLE #0: Wed Apr 20 15:18:53 YEKST 2011 i386
> ls /var/db/pkg | grep jdk
> diablo-jdk-1.6.0.07.02_13
> jdk-1.6.0.3p4_22
>=20=20
> RAM: 2Gb + 4Gb swap file
> Hard disk space 29Gb
>=20=20
> I'm try disable all options, and try enable KDE + JAVA and KDE w/o JAVA.
>=20=20
> there is output of error:
>=20=20
> Entering /var/XXX/libreoffice-build-3.3.2.2/build/libreoffice/connectivit=
y/util
>
> Making: sdbc_hsqldb.dpj
>
> dmake: Executing shell macro: cd $(MISC)/registry/data/org/openoffice/Off=
ice/DataAccess && ls *.xcu
> /usr/local/jdk1.6.0/bin/javac -source 1.5 -target 1.5 -classpath ".:../..=
/../../../../unxfbsdi.pro/class:/usr/local/jdk1.6.0/jre/lib/rt.jar:.:/var/X=
XX/libreoffice-build-3.3.2.2/build/libreoffice/solver/330/unxfbsdi.pro/bin/=
hsqldb.jar::/var/XXX/libreoffice-build-3.3.2.2/build/libreoffice/solver/330=
/unxfbsdi.pro/lib" -d ../../../../../../unxfbsdi.pro/class @/tmp/mkUcfJf6
> terminate called after throwing an instance of 'com::sun::star::lang::Ill=
egalArgumentException'
> /usr/local/bin/bash: line 1: 2894 Abort trap: 6 LD_LIBRARY_PATH=3D${LD_LI=
BRARY_PATH+${LD_LIBRARY_PATH}:}/var/XXX/libreoffice-build-3.3.2.2/build/lib=
reoffice/sfx2/unxfbsdi.pro/lib:/var/XXX/libreoffice-build-3.3.2.2/build/lib=
reoffice/solver/330/unxfbsdi.pro/lib /var/XXX/libreoffice-build-3.3.2.2/bui=
ld/libreoffice/solver/330/unxfbsdi.pro/bin/cppunittester ../../unxfbsdi.pro=
/lib/test_metadatable.so
> dmake: Error code 134, while making 'test1'
> Making: sdbc_hsqldb.dpj
>
> echo "Class-Path: hsqldb.jar .." >> ../../../../../../unxfbsdi.pro/class/=
sdbc_hsqldb/META-INF/MANIFEST.MF
> updating: META-INF/MANIFEST.MF (deflated 7%)
> updating: com/sun/star/sdbcx/comp/hsqldb/NativeInputStreamHelper.class (d=
eflated 55%)
> updating: com/sun/star/sdbcx/comp/hsqldb/StorageNativeInputStream.class (=
deflated 51%)
> updating: com/sun/star/sdbcx/comp/hsqldb/NativeOutputStreamHelper.class (=
deflated 56%)
> updating: com/sun/star/sdbcx/comp/hsqldb/StorageNativeOutputStream.class =
(deflated 50%)
> updating: com/sun/star/sdbcx/comp/hsqldb/NativeStorageAccess.class (defla=
ted 53%)
> updating: com/sun/star/sdbcx/comp/hsqldb/StorageAccess.class (deflated 54=
%)
> updating: com/sun/star/sdbcx/comp/hsqldb/StorageFileAccess$FileSync.class=
 (deflated 52%)
> updating: com/sun/star/sdbcx/comp/hsqldb/StorageFileAccess.class (deflate=
d 57%)
> updating: com/sun/star/sdbcx/comp/hsqldb/NativeLibraries.class (deflated =
46%)
> updating: org/hsqldb/lib/FileSystemRuntimeException.class (deflated 48%)
> connectivity deliver
> Module 'connectivity' delivered successfully. 0 files copied, 115 files u=
nchanged
>
> -----------------------------------------------------------------------
>  Oh dear - something failed during the build - sorry !
>  For more help with debugging build errors, please see the section in:
> http://wiki.documentfoundation.org/Development
>
>  internal build errors:
>
> ERROR: error 65280 occurred while making /var/XXX/libreoffice-build-3.3.2=
.2/build/libreoffice/sfx2/qa/cppunit
> ERROR: error 65280 occurred while making /var/XXX/libreoffice-build-3.3.2=
.2/build/libreoffice/pyuno/source/loader
>
>  it seems you are using a threaded build, which means that the
>  actual compile error is probably hidden far above, and could be
>  inside any of these other modules:
>  sfx2
>  please re-run build inside each one to isolate the problem.
> -----------------------------------------------------------------------
>
> /usr/local/bin/bash
> cd /var/XXX/libreoffice-build-3.3.2.2/build/libreoffice
> source ./FreeBSDX86Env.Set.sh
> cd pyuno
> build
>
> when the problem is isolated and fixed exit and re-run 'make' from the to=
p-level
> sometimes (sadly) it is necessary to rm -Rf unxfbsdi.pro in a module.
> gmake: *** [stamp/build] =A7=B0=A7=EA=A7=DA=A7=D2=A7=DC=A7=D1 1
> *** Error code 1
>
> Stop in /usr/ports/editors/libreoffice.
> *** Error code 1
>
> Stop in /usr/ports/editors/libreoffice.

Hard to tell from this.  Given that the port itself is building in other
places, I'll take a guess and ask if maybe it's running out of space for
the build?  I seem to recall that I had to set TMPDIR to keep
editors/libreoffice from filling up my /tmp directory...

Otherwise, the best advice is probably the advice which you quoted in
the output from the build.




Want to link to this message? Use this URL: <http://docs.FreeBSD.org/cgi/mid.cgi?44bozziqfz.fsf>