Skip site navigation (1)Skip section navigation (2)
Date:      Fri, 24 May 2013 08:19:46 +0200
From:      Baptiste Daroussin <bapt@FreeBSD.org>
To:        mono@FreeBSD.org
Subject:   Fwd: [83amd64-default-newautotools] Build failed for fsharp-3.0.25_1 during build
Message-ID:  <20130524061946.GF96836@ithaqua.etoilebsd.net>

Next in thread | Raw E-Mail | Index | Archive | Help

--PgLV2f+xYr9y+IUc
Content-Type: text/plain; charset=us-ascii
Content-Disposition: inline
Content-Transfer-Encoding: quoted-printable

----- Forwarded message from Baptiste Daroussin <bapt@FreeBSD.org> -----

Date: Fri, 24 May 2013 06:12:13 GMT
=46rom: Baptiste Daroussin <bapt@FreeBSD.org>
To: bapt@FreeBSD.org
Subject: [83amd64-default-newautotools] Build failed for fsharp-3.0.25_1 du=
ring build

Maintainer:     mono@FreeBSD.org
Last committer: bapt
Ident:          Makefile ident:      $FreeBSD: head/lang/fsharp/Makefile 31=
6355 2013-04-23 14:20:25Z bapt $
Log:

=3D=3D=3D=3D>> Building lang/fsharp
build started at Fri May 24 06:11:39 UTC 2013
port directory: /usr/ports/lang/fsharp
building for: FreeBSD 83amd64-default-newautotools-job-23 8.3-RELEASE FreeB=
SD 8.3-RELEASE amd64
maintained by: mono@FreeBSD.org
Makefile ident:      $FreeBSD: head/lang/fsharp/Makefile 316355 2013-04-23 =
14:20:25Z bapt $
Poudriere version: 3.1-pre

---Begin Environment---
OSVERSION=3D803000
UNAME_v=3DFreeBSD 8.3-RELEASE
UNAME_r=3D8.3-RELEASE
FTP_PASSIVE_MODE=3DYES
BLOCKSIZE=3DK
MAIL=3D/var/mail/root
STATUS=3D1
MASTERMNT=3D/zpoudriere/data/build/83amd64-default-newautotools/ref
PKG_EXT=3Dtxz
FORCE_PACKAGE=3Dyes
tpid=3D60853
PATH=3D/sbin:/bin:/usr/sbin:/usr/bin:/usr/games:/usr/local/sbin:/usr/local/=
bin:/root/bin
POUDRIERE_BUILD_TYPE=3Dbulk
NBPARALLEL=3D24
PKGNG=3D1
PKGNAME=3Dfsharp-3.0.25_1
PKG_DELETE=3D/usr/local/sbin/pkg delete -y -f
PKG_ADD=3D/usr/local/sbin/pkg add
PWD=3D/zpoudriere/ports/default/Templates
MASTERNAME=3D83amd64-default-newautotools
USER=3Droot
HOME=3D/root
POUDRIERE_VERSION=3D3.1-pre
SKIPSANITY=3D0
LOCALBASE=3D/usr/local
PACKAGE_BUILDING=3Dyes
---End Environment---

---Begin OPTIONS List---
---End OPTIONS List---

--CONFIGURE_ARGS--
--prefix=3D/usr/local ${_LATE_CONFIGURE_ARGS}
--End CONFIGURE_ARGS--

--CONFIGURE_ENV--
MONO_SHARED_DIR=3D"/wrkdirs/usr/ports/lang/fsharp/work" TMPDIR=3D"/tmp" PKG=
_CONFIG=3Dpkgconf SHELL=3D/bin/sh CONFIG_SHELL=3D/bin/sh MAKE=3Dgmake  AUTO=
CONF=3D/usr/local/bin/autoconf-2.69  AUTOCONF_DIR=3D/usr/local/share/autoco=
nf-2.69  AUTOHEADER=3D/usr/local/bin/autoheader-2.69  AUTOIFNAMES=3D/usr/lo=
cal/bin/ifnames-2.69  AUTOM4TE=3D/usr/local/bin/autom4te-2.69  AUTORECONF=
=3D/usr/local/bin/autoreconf-2.69  AUTOSCAN=3D/usr/local/bin/autoscan-2.69 =
 AUTOUPDATE=3D/usr/local/bin/autoupdate-2.69  AUTOCONF_VERSION=3D2.69  CONF=
IG_SITE=3D/usr/ports/Templates/config.site lt_cv_sys_max_cmd_len=3D262144
--End CONFIGURE_ENV--

--MAKE_ENV--
MONO_SHARED_DIR=3D"/wrkdirs/usr/ports/lang/fsharp/work" TMPDIR=3D"/tmp" SHE=
LL=3D/bin/sh NO_LINT=3DYES  AUTOCONF=3D/usr/local/bin/autoconf-2.69  AUTOCO=
NF_DIR=3D/usr/local/share/autoconf-2.69  AUTOHEADER=3D/usr/local/bin/autohe=
ader-2.69  AUTOIFNAMES=3D/usr/local/bin/ifnames-2.69  AUTOM4TE=3D/usr/local=
/bin/autom4te-2.69  AUTORECONF=3D/usr/local/bin/autoreconf-2.69  AUTOSCAN=
=3D/usr/local/bin/autoscan-2.69  AUTOUPDATE=3D/usr/local/bin/autoupdate-2.6=
9  AUTOCONF_VERSION=3D2.69  PREFIX=3D/usr/local  LOCALBASE=3D/usr/local  MO=
TIFLIB=3D"-L/usr/local/lib -lXm -lXp" LIBDIR=3D"/usr/lib"  CC=3D"cc" CFLAGS=
=3D"-O2 -pipe -fno-strict-aliasing"  CPP=3D"cpp" CPPFLAGS=3D""  LDFLAGS=3D"=
"  CXX=3D"c++" CXXFLAGS=3D"-O2 -pipe -fno-strict-aliasing"  MANPREFIX=3D"/u=
sr/local" BSD_INSTALL_PROGRAM=3D"install  -s -o root -g wheel -m 555"  BSD_=
INSTALL_LIB=3D"install  -s -o root -g wheel -m 444"  BSD_INSTALL_SCRIPT=3D"=
install  -o root -g wheel -m 555"  BSD_INSTALL_DATA=3D"install  -o root -g =
wheel -m 444"  BSD_INSTALL_MAN=3D"install  -o root -g wheel -m 444"
--End MAKE_ENV--

--SUB_LIST--
PREFIX=3D/usr/local
LOCALBASE=3D/usr/local
DATADIR=3D/usr/local/share/fsharp
DOCSDIR=3D/usr/local/share/doc/fsharp
EXAMPLESDIR=3D/usr/local/share/examples/fsharp
WWWDIR=3D/usr/local/www/fsharp
ETCDIR=3D/usr/local/etc/fsharp
--End SUB_LIST--

---Begin make.conf---
USE_PACKAGE_DEPENDS=3Dyes
BATCH=3Dyes
WRKDIRPREFIX=3D/wrkdirs
PACKAGES=3D/packages
DISTDIR=3D/distfiles
#### /usr/local/etc/poudriere.d/make.conf ####
WITH_PKGNG=3Dyes
DISABLE_MAKE_JOBS=3Dyes
---End make.conf---
=3D=3D=3D>  Cleaning for fsharp-3.0.25_1
=3D=3D=3D=3D=3D=3D=3D=3D=3D=3D=3D=3D=3D=3D=3D=3D=3D=3D=3D=3D=3D=3D=3D<phase=
: check-config   >=3D=3D=3D=3D=3D=3D=3D=3D=3D=3D=3D=3D=3D=3D=3D=3D=3D=3D=3D=
=3D=3D=3D=3D=3D=3D=3D=3D=3D
=3D=3D=3D=3D=3D=3D=3D=3D=3D=3D=3D=3D=3D=3D=3D=3D=3D=3D=3D=3D=3D=3D=3D=3D=3D=
=3D=3D=3D=3D=3D=3D=3D=3D=3D=3D=3D=3D=3D=3D=3D=3D=3D=3D=3D=3D=3D=3D=3D=3D=3D=
=3D=3D=3D=3D=3D=3D=3D=3D=3D=3D=3D=3D=3D=3D=3D=3D=3D=3D=3D=3D=3D=3D=3D
=3D=3D=3D=3D=3D=3D=3D=3D=3D=3D=3D=3D=3D=3D=3D=3D=3D=3D=3D=3D=3D=3D=3D<phase=
: pkg-depends    >=3D=3D=3D=3D=3D=3D=3D=3D=3D=3D=3D=3D=3D=3D=3D=3D=3D=3D=3D=
=3D=3D=3D=3D=3D=3D=3D=3D=3D
=3D=3D=3D>   fsharp-3.0.25_1 depends on file: /usr/local/sbin/pkg - not fou=
nd
=3D=3D=3D>    Verifying install for /usr/local/sbin/pkg in /usr/ports/ports=
-mgmt/pkg
=3D=3D=3D>   Installing existing package /packages/All/pkg-1.0.12_1.txz
Installing pkg-1.0.12_1... done
If you are upgrading from the old package format, first run:

  # pkg2ng
=3D=3D=3D>   Returning to build of fsharp-3.0.25_1
=3D=3D=3D=3D=3D=3D=3D=3D=3D=3D=3D=3D=3D=3D=3D=3D=3D=3D=3D=3D=3D=3D=3D=3D=3D=
=3D=3D=3D=3D=3D=3D=3D=3D=3D=3D=3D=3D=3D=3D=3D=3D=3D=3D=3D=3D=3D=3D=3D=3D=3D=
=3D=3D=3D=3D=3D=3D=3D=3D=3D=3D=3D=3D=3D=3D=3D=3D=3D=3D=3D=3D=3D=3D=3D
=3D=3D=3D=3D=3D=3D=3D=3D=3D=3D=3D=3D=3D=3D=3D=3D=3D=3D=3D=3D=3D=3D=3D<phase=
: fetch-depends  >=3D=3D=3D=3D=3D=3D=3D=3D=3D=3D=3D=3D=3D=3D=3D=3D=3D=3D=3D=
=3D=3D=3D=3D=3D=3D=3D=3D=3D
=3D=3D=3D=3D=3D=3D=3D=3D=3D=3D=3D=3D=3D=3D=3D=3D=3D=3D=3D=3D=3D=3D=3D=3D=3D=
=3D=3D=3D=3D=3D=3D=3D=3D=3D=3D=3D=3D=3D=3D=3D=3D=3D=3D=3D=3D=3D=3D=3D=3D=3D=
=3D=3D=3D=3D=3D=3D=3D=3D=3D=3D=3D=3D=3D=3D=3D=3D=3D=3D=3D=3D=3D=3D=3D
=3D=3D=3D=3D=3D=3D=3D=3D=3D=3D=3D=3D=3D=3D=3D=3D=3D=3D=3D=3D=3D=3D=3D<phase=
: fetch          >=3D=3D=3D=3D=3D=3D=3D=3D=3D=3D=3D=3D=3D=3D=3D=3D=3D=3D=3D=
=3D=3D=3D=3D=3D=3D=3D=3D=3D
=3D=3D=3D>  License AL2 accepted by the user
=3D=3D=3D> Fetching all distfiles required by fsharp-3.0.25_1 for building
=3D=3D=3D=3D=3D=3D=3D=3D=3D=3D=3D=3D=3D=3D=3D=3D=3D=3D=3D=3D=3D=3D=3D=3D=3D=
=3D=3D=3D=3D=3D=3D=3D=3D=3D=3D=3D=3D=3D=3D=3D=3D=3D=3D=3D=3D=3D=3D=3D=3D=3D=
=3D=3D=3D=3D=3D=3D=3D=3D=3D=3D=3D=3D=3D=3D=3D=3D=3D=3D=3D=3D=3D=3D=3D
=3D=3D=3D=3D=3D=3D=3D=3D=3D=3D=3D=3D=3D=3D=3D=3D=3D=3D=3D=3D=3D=3D=3D<phase=
: checksum       >=3D=3D=3D=3D=3D=3D=3D=3D=3D=3D=3D=3D=3D=3D=3D=3D=3D=3D=3D=
=3D=3D=3D=3D=3D=3D=3D=3D=3D
=3D=3D=3D>  License AL2 accepted by the user
=3D=3D=3D> Fetching all distfiles required by fsharp-3.0.25_1 for building
=3D> SHA256 Checksum OK for 3.0.25.
=3D=3D=3D=3D=3D=3D=3D=3D=3D=3D=3D=3D=3D=3D=3D=3D=3D=3D=3D=3D=3D=3D=3D=3D=3D=
=3D=3D=3D=3D=3D=3D=3D=3D=3D=3D=3D=3D=3D=3D=3D=3D=3D=3D=3D=3D=3D=3D=3D=3D=3D=
=3D=3D=3D=3D=3D=3D=3D=3D=3D=3D=3D=3D=3D=3D=3D=3D=3D=3D=3D=3D=3D=3D=3D
=3D=3D=3D=3D=3D=3D=3D=3D=3D=3D=3D=3D=3D=3D=3D=3D=3D=3D=3D=3D=3D=3D=3D<phase=
: extract-depends>=3D=3D=3D=3D=3D=3D=3D=3D=3D=3D=3D=3D=3D=3D=3D=3D=3D=3D=3D=
=3D=3D=3D=3D=3D=3D=3D=3D=3D
=3D=3D=3D=3D=3D=3D=3D=3D=3D=3D=3D=3D=3D=3D=3D=3D=3D=3D=3D=3D=3D=3D=3D=3D=3D=
=3D=3D=3D=3D=3D=3D=3D=3D=3D=3D=3D=3D=3D=3D=3D=3D=3D=3D=3D=3D=3D=3D=3D=3D=3D=
=3D=3D=3D=3D=3D=3D=3D=3D=3D=3D=3D=3D=3D=3D=3D=3D=3D=3D=3D=3D=3D=3D=3D
=3D=3D=3D=3D=3D=3D=3D=3D=3D=3D=3D=3D=3D=3D=3D=3D=3D=3D=3D=3D=3D=3D=3D<phase=
: extract        >=3D=3D=3D=3D=3D=3D=3D=3D=3D=3D=3D=3D=3D=3D=3D=3D=3D=3D=3D=
=3D=3D=3D=3D=3D=3D=3D=3D=3D
=3D=3D=3D>  License AL2 accepted by the user
=3D=3D=3D> Fetching all distfiles required by fsharp-3.0.25_1 for building
=3D=3D=3D>  Extracting for fsharp-3.0.25_1
=3D> SHA256 Checksum OK for 3.0.25.
=3D=3D=3D=3D=3D=3D=3D=3D=3D=3D=3D=3D=3D=3D=3D=3D=3D=3D=3D=3D=3D=3D=3D=3D=3D=
=3D=3D=3D=3D=3D=3D=3D=3D=3D=3D=3D=3D=3D=3D=3D=3D=3D=3D=3D=3D=3D=3D=3D=3D=3D=
=3D=3D=3D=3D=3D=3D=3D=3D=3D=3D=3D=3D=3D=3D=3D=3D=3D=3D=3D=3D=3D=3D=3D
=3D=3D=3D=3D=3D=3D=3D=3D=3D=3D=3D=3D=3D=3D=3D=3D=3D=3D=3D=3D=3D=3D=3D<phase=
: patch-depends  >=3D=3D=3D=3D=3D=3D=3D=3D=3D=3D=3D=3D=3D=3D=3D=3D=3D=3D=3D=
=3D=3D=3D=3D=3D=3D=3D=3D=3D
=3D=3D=3D=3D=3D=3D=3D=3D=3D=3D=3D=3D=3D=3D=3D=3D=3D=3D=3D=3D=3D=3D=3D=3D=3D=
=3D=3D=3D=3D=3D=3D=3D=3D=3D=3D=3D=3D=3D=3D=3D=3D=3D=3D=3D=3D=3D=3D=3D=3D=3D=
=3D=3D=3D=3D=3D=3D=3D=3D=3D=3D=3D=3D=3D=3D=3D=3D=3D=3D=3D=3D=3D=3D=3D
=3D=3D=3D=3D=3D=3D=3D=3D=3D=3D=3D=3D=3D=3D=3D=3D=3D=3D=3D=3D=3D=3D=3D<phase=
: patch          >=3D=3D=3D=3D=3D=3D=3D=3D=3D=3D=3D=3D=3D=3D=3D=3D=3D=3D=3D=
=3D=3D=3D=3D=3D=3D=3D=3D=3D
=3D=3D=3D>  Patching for fsharp-3.0.25_1
=3D=3D=3D>  Applying FreeBSD patches for fsharp-3.0.25_1
=3D=3D=3D=3D=3D=3D=3D=3D=3D=3D=3D=3D=3D=3D=3D=3D=3D=3D=3D=3D=3D=3D=3D=3D=3D=
=3D=3D=3D=3D=3D=3D=3D=3D=3D=3D=3D=3D=3D=3D=3D=3D=3D=3D=3D=3D=3D=3D=3D=3D=3D=
=3D=3D=3D=3D=3D=3D=3D=3D=3D=3D=3D=3D=3D=3D=3D=3D=3D=3D=3D=3D=3D=3D=3D
=3D=3D=3D=3D=3D=3D=3D=3D=3D=3D=3D=3D=3D=3D=3D=3D=3D=3D=3D=3D=3D=3D=3D<phase=
: build-depends  >=3D=3D=3D=3D=3D=3D=3D=3D=3D=3D=3D=3D=3D=3D=3D=3D=3D=3D=3D=
=3D=3D=3D=3D=3D=3D=3D=3D=3D
=3D=3D=3D>   fsharp-3.0.25_1 depends on package: mono>=3D3.0 - not found
=3D=3D=3D>    Verifying install for mono>=3D3.0 in /usr/ports/lang/mono
=3D=3D=3D>   Installing existing package /packages/All/mono-3.0.3_2.txz
Installing mono-3.0.3_2...Installing gamin-0.1.10_5...Installing gettext-0.=
18.1.1_1...Installing libiconv-1.14_1... done
 done
Installing glib-2.34.3...Installing libffi-3.0.13... done
Installing pcre-8.32... done
Installing perl-5.14.2_3...Removing stale symlinks from /usr/bin...
    Skipping /usr/bin/perl
    Skipping /usr/bin/perl5
Done.
Creating various symlinks in /usr/bin...
    Symlinking /usr/local/bin/perl5.14.2 to /usr/bin/perl
    Symlinking /usr/local/bin/perl5.14.2 to /usr/bin/perl5
Done.
Cleaning up /etc/make.conf... Done.
Spamming /etc/make.conf... Done.
Cleaning up /etc/manpath.config... Done.
Spamming /etc/manpath.config... Done.
 done
Installing python27-2.7.5... done
No schema files found: doing nothing.
 done
 done
Installing gio-fam-backend-2.34.3... done
 done
=3D=3D=3D=3D
Note that some of the standard modules are provided as separate
ports since they require extra dependencies:

bsddb           databases/py-bsddb
gdbm            databases/py-gdbm
sqlite3         databases/py-sqlite3
tkinter         x11-toolkits/py-tkinter

Install them as needed.
=3D=3D=3D=3D
=3D=3D=3D=3D=3D=3D=3D=3D=3D=3D=3D=3D=3D=3D=3D=3D=3D=3D=3D=3D=3D=3D=3D=3D=3D=
=3D=3D=3D=3D=3D=3D=3D=3D=3D=3D=3D=3D=3D=3D=3D=3D=3D=3D=3D=3D=3D=3D=3D=3D=3D=
=3D=3D=3D=3D=3D=3D=3D=3D=3D=3D=3D=3D=3D=3D=3D=3D=3D=3D=3D=3D=3D=3D=3D=3D=3D=
=3D=3D=3D=3D

Gamin will only provide realtime notification of changes for at most n file=
s,
where n is the minimum value between (kern.maxfiles * 0.7) and
(kern.maxfilesperproc - 200). Beyond that limit, files will be polled.

If you often open several large folders with Nautilus, you might want to
increase the kern.maxfiles tunable (you do not need to set
kern.maxfilesperproc, since it is computed at boot time from kern.maxfiles).

For a typical desktop, add the following line to /boot/loader.conf, then
reboot the system:

    kern.maxfiles=3D"25000"

The behavior of gamin can be controlled via the various gaminrc files.
See http://www.gnome.org/~veillard/gamin/config.html on how to create
these files.  In particular, if you find gam_server is taking up too much
CPU time polling for changes, something like the following may help
in one of the gaminrc files:

# reduce polling frequency to once per 10 seconds
# for UFS file systems in order to lower CPU load
fsset ufs poll 10

=3D=3D=3D=3D=3D=3D=3D=3D=3D=3D=3D=3D=3D=3D=3D=3D=3D=3D=3D=3D=3D=3D=3D=3D=3D=
=3D=3D=3D=3D=3D=3D=3D=3D=3D=3D=3D=3D=3D=3D=3D=3D=3D=3D=3D=3D=3D=3D=3D=3D=3D=
=3D=3D=3D=3D=3D=3D=3D=3D=3D=3D=3D=3D=3D=3D=3D=3D=3D=3D=3D=3D=3D=3D=3D=3D=3D=
=3D=3D=3D=3D
************************************************************************
If you have build/runtime errors with Mono and Gtk# apps please try the
following first:

* Build Mono and gtk+ (x11-toolkits/gtk20) without CPUTYPE and with the
  default FreeBSD CFLAGS ('-O2 -fno-strict-aliasing -pipe') as Mono has
  been known to expose compiler bugs.

* Try building and running Mono with the GENERIC kernel.
  - Mono requires SYSVSHM, SYSVMSG, and SYSVSEM which are part of the
    GENERIC kernel.
  - Removing kernel options or changing defaults to use experimental
    options can adversely affect Mono's ability to build and run.

* Remove leftover semaphores / increase semaphore limits.
  - Close apps which use Mono and run `ipcs -sbt`.  Remove the
    semaphores with MODE "--rw-------" and NSEMS "8" using ipcrm (1)
  - _OR_ simply reboot which is the safest method.
  - On multi-user systems the semaphore limits may need to be increased
    from the defaults. The following should comfortably support 30 users.

    # echo "kern.ipc.semmni=3D40" >> /boot/loader.conf
    # echo "kern.ipc.semmns=3D300" >> /boot/loader.conf

* If you are in a jailed environment, ensure System V IPC are enabled.
  You can rely on the security.jail.sysvipc_allowed  sysctl to check
  this status.  The following enables this feature on the host system:
    # echo "jail_sysvipc_allow=3D\"YES\"" >> /etc/rc.conf

* Some process information are acceded through /proc (e.g. when using
  NUnit) and procfs(5) has to be mounted for these features to work:
    # echo "proc            /proc   procfs  rw 0 0" >> /etc/fstab
************************************************************************
=3D=3D=3D>   Returning to build of fsharp-3.0.25_1
=3D=3D=3D>   fsharp-3.0.25_1 depends on executable: pkgconf - not found
=3D=3D=3D>    Verifying install for pkgconf in /usr/ports/devel/pkgconf
=3D=3D=3D>   Installing existing package /packages/All/pkgconf-0.9.2_1.txz
Installing pkgconf-0.9.2_1... done
=3D=3D=3D>   Returning to build of fsharp-3.0.25_1
=3D=3D=3D>   fsharp-3.0.25_1 depends on executable: gmake - not found
=3D=3D=3D>    Verifying install for gmake in /usr/ports/devel/gmake
=3D=3D=3D>   Installing existing package /packages/All/gmake-3.82_1.txz
Installing gmake-3.82_1... done
=3D=3D=3D>   Returning to build of fsharp-3.0.25_1
=3D=3D=3D>   fsharp-3.0.25_1 depends on file: /usr/local/bin/autoconf-2.69 =
- not found
=3D=3D=3D>    Verifying install for /usr/local/bin/autoconf-2.69 in /usr/po=
rts/devel/autoconf
=3D=3D=3D>   Installing existing package /packages/All/autoconf-2.69.txz
Installing autoconf-2.69...Installing autoconf-wrapper-20101119... done
Installing m4-1.4.16_1,1... done
 done
=3D=3D=3D>   Returning to build of fsharp-3.0.25_1
=3D=3D=3D=3D=3D=3D=3D=3D=3D=3D=3D=3D=3D=3D=3D=3D=3D=3D=3D=3D=3D=3D=3D=3D=3D=
=3D=3D=3D=3D=3D=3D=3D=3D=3D=3D=3D=3D=3D=3D=3D=3D=3D=3D=3D=3D=3D=3D=3D=3D=3D=
=3D=3D=3D=3D=3D=3D=3D=3D=3D=3D=3D=3D=3D=3D=3D=3D=3D=3D=3D=3D=3D=3D=3D
=3D=3D=3D=3D=3D=3D=3D=3D=3D=3D=3D=3D=3D=3D=3D=3D=3D=3D=3D=3D=3D=3D=3D<phase=
: lib-depends    >=3D=3D=3D=3D=3D=3D=3D=3D=3D=3D=3D=3D=3D=3D=3D=3D=3D=3D=3D=
=3D=3D=3D=3D=3D=3D=3D=3D=3D
=3D=3D=3D=3D=3D=3D=3D=3D=3D=3D=3D=3D=3D=3D=3D=3D=3D=3D=3D=3D=3D=3D=3D=3D=3D=
=3D=3D=3D=3D=3D=3D=3D=3D=3D=3D=3D=3D=3D=3D=3D=3D=3D=3D=3D=3D=3D=3D=3D=3D=3D=
=3D=3D=3D=3D=3D=3D=3D=3D=3D=3D=3D=3D=3D=3D=3D=3D=3D=3D=3D=3D=3D=3D=3D
=3D=3D=3D=3D=3D=3D=3D=3D=3D=3D=3D=3D=3D=3D=3D=3D=3D=3D=3D=3D=3D=3D=3D<phase=
: configure      >=3D=3D=3D=3D=3D=3D=3D=3D=3D=3D=3D=3D=3D=3D=3D=3D=3D=3D=3D=
=3D=3D=3D=3D=3D=3D=3D=3D=3D
=3D=3D=3D>  Configuring for fsharp-3.0.25_1
configure: loading site script /usr/ports/Templates/config.site
checking whether gmake sets $(MAKE)... yes
checking for pkg-config... /usr/local/bin/pkg-config
checking for mono-sgen... /usr/local/bin/mono-sgen
configure: creating ./config.status
config.status: creating launcher
config.status: creating Makefile
config.status: creating config.make
config.status: creating src/fsharp/Makefile
config.status: creating src/fsharp/FSharp.Build-proto/Makefile
config.status: creating src/fsharp/FSharp.Compiler-proto/Makefile
config.status: creating src/fsharp/Fsc-proto/Makefile
config.status: creating src/fsharp/FSharp.Core/Makefile
config.status: creating src/fsharp/FSharp.Build/Makefile
config.status: creating src/fsharp/FSharp.Compiler/Makefile
config.status: creating src/fsharp/Fsc/Makefile
config.status: creating src/fsharp/FSharp.Compiler.Interactive.Settings/Mak=
efile
config.status: creating src/fsharp/FSharp.Compiler.Server.Shared/Makefile
config.status: creating src/fsharp/fsi/Makefile
config.status: creating src/fsharp/fsiAnyCpu/Makefile
config.status: creating src/fsharp/policy.2.0.FSharp.Core/Makefile
config.status: creating src/fsharp/policy.4.0.FSharp.Core/Makefile
config.status: creating src/fsharp/policy.2.3.FSharp.Core/Makefile
config.status: creating src/fsharp/policy.4.3.FSharp.Core/Makefile
=3D=3D=3D=3D=3D=3D=3D=3D=3D=3D=3D=3D=3D=3D=3D=3D=3D=3D=3D=3D=3D=3D=3D=3D=3D=
=3D=3D=3D=3D=3D=3D=3D=3D=3D=3D=3D=3D=3D=3D=3D=3D=3D=3D=3D=3D=3D=3D=3D=3D=3D=
=3D=3D=3D=3D=3D=3D=3D=3D=3D=3D=3D=3D=3D=3D=3D=3D=3D=3D=3D=3D=3D=3D=3D
=3D=3D=3D=3D=3D=3D=3D=3D=3D=3D=3D=3D=3D=3D=3D=3D=3D=3D=3D=3D=3D=3D=3D<phase=
: build          >=3D=3D=3D=3D=3D=3D=3D=3D=3D=3D=3D=3D=3D=3D=3D=3D=3D=3D=3D=
=3D=3D=3D=3D=3D=3D=3D=3D=3D
=3D=3D=3D>  Building for fsharp-3.0.25_1
gmake -C src/fsharp all
gmake[1]: Entering directory `/wrkdirs/usr/ports/lang/fsharp/work/fsharp-3.=
0.25/src/fsharp'
gmake do-proto
gmake[2]: Entering directory `/wrkdirs/usr/ports/lang/fsharp/work/fsharp-3.=
0.25/src/fsharp'
gmake -C FSharp.Build-proto do-proto
gmake[3]: Entering directory `/wrkdirs/usr/ports/lang/fsharp/work/fsharp-3.=
0.25/src/fsharp/FSharp.Build-proto'
mkdir -p .libs//
mkdir -p .libs//2.0
mkdir -p .libs//4.0
mono --gc=3Dsgen /wrkdirs/usr/ports/lang/fsharp/work/fsharp-3.0.25/lib/boot=
strap/4.0/../2.0/fssrgen.exe ../FSharp.Build/FSBuild.txt .libs/FSBuild.fs .=
libs/FSBuild.resx
gmake[3]: *** [.libs/FSBuild.resources] Abort trap: 6 (core dumped)
gmake[3]: Leaving directory `/wrkdirs/usr/ports/lang/fsharp/work/fsharp-3.0=
=2E25/src/fsharp/FSharp.Build-proto'
gmake[2]: *** [do-proto] Error 2
gmake[2]: Leaving directory `/wrkdirs/usr/ports/lang/fsharp/work/fsharp-3.0=
=2E25/src/fsharp'
gmake[1]: *** [all] Error 2
gmake[1]: Leaving directory `/wrkdirs/usr/ports/lang/fsharp/work/fsharp-3.0=
=2E25/src/fsharp'
gmake: *** [all] Error 2
*** Error code 1

Stop in /usr/ports/lang/fsharp.
=3D=3D=3D>  Cleaning for fsharp-3.0.25_1

----- End forwarded message -----

--PgLV2f+xYr9y+IUc
Content-Type: application/pgp-signature

-----BEGIN PGP SIGNATURE-----
Version: GnuPG v2.0.19 (FreeBSD)

iEYEARECAAYFAlGfBoIACgkQ8kTtMUmk6EzKpwCfRFjyclr1rfOgsiwnEnFup0Ip
2GUAn1ZXfTxqorE1+9tcGFRQpOPc15XB
=DDB+
-----END PGP SIGNATURE-----

--PgLV2f+xYr9y+IUc--



Want to link to this message? Use this URL: <http://docs.FreeBSD.org/cgi/mid.cgi?20130524061946.GF96836>