Skip site navigation (1)Skip section navigation (2)
Date:      Mon, 04 Jan 2021 06:19:51 +0000
From:      faikeregq@gmail.com
To:        freebsd-pkg-fallout@freebsd.org
Subject:   =?UTF-8?B?QUnlpKfmlbDmja7mioDmnK/vvIzoh6rliqjljJbojrflrqLml7bku6M=?=
Message-ID:  <000000000000d9174b05b80d13b4@google.com>

Next in thread | Raw E-Mail | Index | Archive | Help
0J/RgNC10LTQu9Cw0LPQsNGOINCy0LDQvCDQt9Cw0L/QvtC70L3QuNGC0Ywg0Y3RgtGDINGE0L7R
gNC80YM6DQpBSeWkp+aVsOaNruaKgOacr++8jOiHquWKqOWMluiOt+WuouaXtuS7ow0KDQrQp9GC
0L7QsdGLINC30LDQv9C+0LvQvdC40YLRjCDRhNC+0YDQvNGDLCDQv9C10YDQtdC50LTQuNGC0LUg
0L3QsCDRjdGC0YMg0YHRgtGA0LDQvdC40YbRgzoNCmh0dHBzOi8vZG9jcy5nb29nbGUuY29tL2Zv
cm1zL2QvZS8xRkFJcFFMU2YycW1iOVVHajVpT05naHhXbk1lYUE1d2VXOVc4RlVfRGoxNUN5YTl6
dXN6TTRvQS92aWV3Zm9ybT92Yz0wJmFtcDtjPTAmYW1wO3c9MSZhbXA7ZmxyPTAmYW1wO3VzcD1t
YWlsX2Zvcm1fbGluaw0KDQrQn9GA0LXQtNC70LDQs9Cw0Y4g0LLQsNC8INC30LDQv9C+0LvQvdC4
0YLRjCDRjdGC0YMg0YTQvtGA0LzRgzoNCg0KR29vZ2xlwqDQpNC+0YDQvNGLOiDRgdC+0LfQtNCw
0LLQsNC50YLQtSDQuCDQsNC90LDQu9C40LfQuNGA0YPQudGC0LUg0L7Qv9GA0L7RgdGLLg0K
From owner-freebsd-pkg-fallout@freebsd.org  Mon Jan  4 06:28:05 2021
Return-Path: <owner-freebsd-pkg-fallout@freebsd.org>
Delivered-To: freebsd-pkg-fallout@mailman.nyi.freebsd.org
Received: from mx1.freebsd.org (mx1.freebsd.org [IPv6:2610:1c1:1:606c::19:1])
 by mailman.nyi.freebsd.org (Postfix) with ESMTP id 960474CC1E1
 for <freebsd-pkg-fallout@mailman.nyi.freebsd.org>;
 Mon,  4 Jan 2021 06:28:05 +0000 (UTC)
 (envelope-from pkg-fallout@FreeBSD.org)
Received: from mailman.nyi.freebsd.org (mailman.nyi.freebsd.org
 [IPv6:2610:1c1:1:606c::50:13])
 by mx1.freebsd.org (Postfix) with ESMTP id 4D8Qfs3nhVz3pdZ
 for <freebsd-pkg-fallout@freebsd.org>; Mon,  4 Jan 2021 06:28:05 +0000 (UTC)
 (envelope-from pkg-fallout@FreeBSD.org)
Received: by mailman.nyi.freebsd.org (Postfix)
 id 801AC4CC1E0; Mon,  4 Jan 2021 06:28:05 +0000 (UTC)
Delivered-To: pkg-fallout@mailman.nyi.freebsd.org
Received: from mx1.freebsd.org (mx1.freebsd.org [IPv6:2610:1c1:1:606c::19:1])
 by mailman.nyi.freebsd.org (Postfix) with ESMTP id 7FDAB4CC493
 for <pkg-fallout@mailman.nyi.freebsd.org>;
 Mon,  4 Jan 2021 06:28:05 +0000 (UTC)
 (envelope-from pkg-fallout@FreeBSD.org)
Received: from mxrelay.nyi.freebsd.org (mxrelay.nyi.freebsd.org
 [IPv6:2610:1c1:1:606c::19:3])
 (using TLSv1.3 with cipher TLS_AES_256_GCM_SHA384 (256/256 bits)
 key-exchange X25519 server-signature RSA-PSS (4096 bits) server-digest SHA256
 client-signature RSA-PSS (4096 bits) client-digest SHA256)
 (Client CN "mxrelay.nyi.freebsd.org",
 Issuer "Let's Encrypt Authority X3" (verified OK))
 by mx1.freebsd.org (Postfix) with ESMTPS id 4D8Qfs3FVrz3pxd
 for <pkg-fallout@FreeBSD.org>; Mon,  4 Jan 2021 06:28:05 +0000 (UTC)
 (envelope-from pkg-fallout@FreeBSD.org)
Received: from pylon.nyi.freebsd.org (pylon.nyi.freebsd.org
 [IPv6:2610:1c1:1:6082::16:fc])
 (using TLSv1.3 with cipher TLS_AES_256_GCM_SHA384 (256/256 bits)
 key-exchange X25519 server-signature RSA-PSS (4096 bits) server-digest SHA256)
 (Client did not present a certificate)
 by mxrelay.nyi.freebsd.org (Postfix) with ESMTPS id 5D374156DE
 for <pkg-fallout@FreeBSD.org>; Mon,  4 Jan 2021 06:28:05 +0000 (UTC)
 (envelope-from pkg-fallout@FreeBSD.org)
Received: from pylon.nyi.freebsd.org (localhost [127.0.0.1])
 by pylon.nyi.freebsd.org (8.16.1/8.16.1) with ESMTP id 1046S5sd035773
 for <pkg-fallout@FreeBSD.org>; Mon, 4 Jan 2021 06:28:05 GMT
 (envelope-from pkg-fallout@FreeBSD.org)
Received: (from root@localhost)
 by pylon.nyi.freebsd.org (8.16.1/8.16.1/Submit) id 1046S5qv035770;
 Mon, 4 Jan 2021 06:28:05 GMT (envelope-from pkg-fallout@FreeBSD.org)
Date: Mon, 4 Jan 2021 06:28:05 GMT
From: pkg-fallout@FreeBSD.org
Message-Id: <202101040628.1046S5qv035770@pylon.nyi.freebsd.org>
To: pkg-fallout@FreeBSD.org
Subject: [package - 121powerpc64-quarterly][devel/ocaml-opam] Failed for
 ocaml-opam-2.0.6_1 in build
X-BeenThere: freebsd-pkg-fallout@freebsd.org
X-Mailman-Version: 2.1.34
Precedence: list
List-Id: Fallout logs from package building <freebsd-pkg-fallout.freebsd.org>
List-Unsubscribe: <https://lists.freebsd.org/mailman/options/freebsd-pkg-fallout>, 
 <mailto:freebsd-pkg-fallout-request@freebsd.org?subject=unsubscribe>
List-Archive: <http://lists.freebsd.org/pipermail/freebsd-pkg-fallout/>;
List-Post: <mailto:freebsd-pkg-fallout@freebsd.org>
List-Help: <mailto:freebsd-pkg-fallout-request@freebsd.org?subject=help>
List-Subscribe: <https://lists.freebsd.org/mailman/listinfo/freebsd-pkg-fallout>, 
 <mailto:freebsd-pkg-fallout-request@freebsd.org?subject=subscribe>
X-List-Received-Date: Mon, 04 Jan 2021 06:28:05 -0000


You are receiving this mail as a port that you maintain
is failing to build on the FreeBSD package build server.
Please investigate the failure and submit a PR to fix
build.

Maintainer:     hannes@mehnert.org
Last committer: arrowd@FreeBSD.org
Ident:          $FreeBSD: branches/2020Q4/devel/ocaml-opam/Makefile 547798 2020-09-06 15:09:27Z arrowd $
Log URL:        http://pylon.nyi.freebsd.org/data/121powerpc64-quarterly/559696/logs/ocaml-opam-2.0.6_1.log
Build URL:      http://pylon.nyi.freebsd.org/build.html?mastername=121powerpc64-quarterly&build=559696
Log:

=>> Building devel/ocaml-opam
build started at Mon Jan  4 06:24:23 UTC 2021
port directory: /usr/ports/devel/ocaml-opam
package name: ocaml-opam-2.0.6_1
building for: FreeBSD 121powerpc64-quarterly-job-02 12.1-RELEASE-p10 FreeBSD 12.1-RELEASE-p10 1201000 powerpc
maintained by: hannes@mehnert.org
Makefile ident:      $FreeBSD: branches/2020Q4/devel/ocaml-opam/Makefile 547798 2020-09-06 15:09:27Z arrowd $
Poudriere version: 3.2.8-8-gaf08dbda
Host OSVERSION: 1300121
Jail OSVERSION: 1201000
Job Id: 02

---Begin Environment---
SHELL=/bin/csh
OSVERSION=1201000
UNAME_v=FreeBSD 12.1-RELEASE-p10 1201000
UNAME_r=12.1-RELEASE-p10
BLOCKSIZE=K
MAIL=/var/mail/root
STATUS=1
HOME=/root
PATH=/sbin:/bin:/usr/sbin:/usr/bin:/usr/local/sbin:/usr/local/bin:/root/bin
LOCALBASE=/usr/local
USER=root
LIBEXECPREFIX=/usr/local/libexec/poudriere
POUDRIERE_VERSION=3.2.8-8-gaf08dbda
MASTERMNT=/usr/local/poudriere/data/.m/121powerpc64-quarterly/ref
POUDRIERE_BUILD_TYPE=bulk
PACKAGE_BUILDING=yes
SAVED_TERM=
PWD=/usr/local/poudriere/data/.m/121powerpc64-quarterly/ref/.p/pool
P_PORTS_FEATURES=FLAVORS SELECTED_OPTIONS
MASTERNAME=121powerpc64-quarterly
SCRIPTPREFIX=/usr/local/share/poudriere
OLDPWD=/usr/local/poudriere/data/.m/121powerpc64-quarterly/ref/.p
SCRIPTPATH=/usr/local/share/poudriere/bulk.sh
POUDRIEREPATH=/usr/local/bin/poudriere
---End Environment---

---Begin Poudriere Port Flags/Env---
PORT_FLAGS=
PKGENV=
FLAVOR=
DEPENDS_ARGS=
MAKE_ARGS=
---End Poudriere Port Flags/Env---

---Begin OPTIONS List---
===> The following configuration options are available for ocaml-opam-2.0.6_1:
     DARCS=off: Remote repository synchronized with darcs
     GIT=on: Remote repository synchronized with git
     HG=off: Remote repository synchronized with mercurial
     RSYNC=on: Remote repository synchronized with Rsync
===> Use 'make config' to modify these settings
---End OPTIONS List---

--MAINTAINER--
hannes@mehnert.org
--End MAINTAINER--

--CONFIGURE_ARGS--
--disable-checks --prefix=/usr/local ${_LATE_CONFIGURE_ARGS}
--End CONFIGURE_ARGS--

--CONFIGURE_ENV--
MAKE=gmake XDG_DATA_HOME=/wrkdirs/usr/ports/devel/ocaml-opam/work  XDG_CONFIG_HOME=/wrkdirs/usr/ports/devel/ocaml-opam/work  HOME=/wrkdirs/usr/ports/devel/ocaml-opam/work TMPDIR="/tmp" PATH=/wrkdirs/usr/ports/devel/ocaml-opam/work/.bin:/sbin:/bin:/usr/sbin:/usr/bin:/usr/local/sbin:/usr/local/bin:/root/bin SHELL=/bin/sh CONFIG_SHELL=/bin/sh CONFIG_SITE=/usr/ports/Templates/config.site lt_cv_sys_max_cmd_len=524288
--End CONFIGURE_ENV--

--MAKE_ENV--
XDG_DATA_HOME=/wrkdirs/usr/ports/devel/ocaml-opam/work  XDG_CONFIG_HOME=/wrkdirs/usr/ports/devel/ocaml-opam/work  HOME=/wrkdirs/usr/ports/devel/ocaml-opam/work TMPDIR="/tmp" PATH=/wrkdirs/usr/ports/devel/ocaml-opam/work/.bin:/sbin:/bin:/usr/sbin:/usr/bin:/usr/local/sbin:/usr/local/bin:/root/bin NO_PIE=yes MK_DEBUG_FILES=no MK_KERNEL_SYMBOLS=no SHELL=/bin/sh NO_LINT=YES PREFIX=/usr/local  LOCALBASE=/usr/local  CC="cc" CFLAGS="-O2 -pipe  -fstack-protector-strong -fno-strict-aliasing "  CPP="cpp" CPPFLAGS=""  LDFLAGS=" -fstack-protector-strong " LIBS=""  CXX="c++" CXXFLAGS="-O2 -pipe -fstack-protector-strong -fno-strict-aliasing  "  MANPREFIX="/usr/local" BSD_INSTALL_PROGRAM="install  -s -m 555"  BSD_INSTALL_LIB="install  -s -m 0644"  BSD_INSTALL_SCRIPT="install  -m 555"  BSD_INSTALL_DATA="install  -m 0644"  BSD_INSTALL_MAN="install  -m 444"
--End MAKE_ENV--

--PLIST_SUB--
OCAML_SITELIBDIR="lib/ocaml/site-lib" OSREL=12.1 PREFIX=%D LOCALBASE=/usr/local  RESETPREFIX=/usr/local LIB32DIR=lib DOCSDIR="share/doc/opam"  EXAMPLESDIR="share/examples/opam"  DATADIR="share/opam"  WWWDIR="www/opam"  ETCDIR="etc/opam"
--End PLIST_SUB--

--SUB_LIST--
PREFIX=/usr/local LOCALBASE=/usr/local  DATADIR=/usr/local/share/opam DOCSDIR=/usr/local/share/doc/opam EXAMPLESDIR=/usr/local/share/examples/opam  WWWDIR=/usr/local/www/opam ETCDIR=/usr/local/etc/opam
--End SUB_LIST--

---Begin make.conf---
USE_PACKAGE_DEPENDS=yes
BATCH=yes
WRKDIRPREFIX=/wrkdirs
PORTSDIR=/usr/ports
PACKAGES=/packages
DISTDIR=/distfiles
PACKAGE_BUILDING=yes
PACKAGE_BUILDING_FLAVORS=yes
#### /usr/local/etc/poudriere.d/make.conf ####
# XXX: We really need this but cannot use it while 'make checksum' does not
# try the next mirror on checksum failure.  It currently retries the same
# failed mirror and then fails rather then trying another.  It *does*
# try the next if the size is mismatched though.
#MASTER_SITE_FREEBSD=yes
# Build ALLOW_MAKE_JOBS_PACKAGES with 2 jobs
MAKE_JOBS_NUMBER=2
#### /usr/ports/Mk/Scripts/ports_env.sh ####
_CCVERSION_921dbbb2=cc (GCC) 4.2.1 20070831 patched [FreeBSD] Copyright (C) 2007 Free Software Foundation, Inc. This is free software; see the source for copying conditions. There is NO warranty; not even for MERCHANTABILITY or FITNESS FOR A PARTICULAR PURPOSE.
_ALTCCVERSION_921dbbb2=none
_CXXINTERNAL_acaad9ca=Using built-in specs. Target: powerpc64-undermydesk-freebsd Configured with: FreeBSD/powerpc64 system compiler Thread model: posix gcc version 4.2.1 20070831 patched [FreeBSD] "/usr/bin/ld" "--eh-frame-hdr" "-Qy" "-melf64ppc_fbsd" "--enable-new-dtags" "-dynamic-linker" "/libexec/ld-elf.so.1" "/usr/lib/crt1.o" "/usr/lib/crti.o" "/usr/lib/crtbegin.o" "-L/usr/lib" "-L/usr/lib" "/dev/null" "-lstdc++" "-lm" "-lgcc_s" "-lgcc" "-lc" "-lgcc_s" "-lgcc" "/usr/lib/crtsavres.o" "/usr/lib/crtend.o" "/usr/lib/crtn.o"
CC_OUTPUT_921dbbb2_58173849=yes
CC_OUTPUT_921dbbb2_9bdba57c=yes
CC_OUTPUT_921dbbb2_6a4fe7f5=cc1: error: unrecognized command line option "-std=c11"
CC_OUTPUT_921dbbb2_6bcac02b=yes
CC_OUTPUT_921dbbb2_67d20829=yes
CC_OUTPUT_921dbbb2_bfa62e83=cc1: error: unrecognized command line option "-std=gnu11"
CC_OUTPUT_921dbbb2_f0b4d593=yes
CC_OUTPUT_921dbbb2_308abb44=cc1plus: error: unrecognized command line option "-std=c++0x"
CC_OUTPUT_921dbbb2_f00456e5=cc1plus: error: unrecognized command line option "-std=c++11"
CC_OUTPUT_921dbbb2_65ad290d=cc1plus: error: unrecognized command line option "-std=c++14"
CC_OUTPUT_921dbbb2_f2776b26=cc1plus: error: unrecognized command line option "-std=c++17"
CC_OUTPUT_921dbbb2_b2657cc3=yes
CC_OUTPUT_921dbbb2_380987f7=cc1plus: error: unrecognized command line option "-std=gnu++11"
CC_OUTPUT_921dbbb2_160933ec=cc1plus: error: unrecognized command line option "-std=gnu++14"
CC_OUTPUT_921dbbb2_fb62803b=cc1plus: error: unrecognized command line option "-std=gnu++17"
_OBJC_CCVERSION_921dbbb2=cc (GCC) 4.2.1 20070831 patched [FreeBSD] Copyright (C) 2007 Free Software Foundation, Inc. This is free software; see the source for copying conditions. There is NO warranty; not even for MERCHANTABILITY or FITNESS FOR A PARTICULAR PURPOSE.
_OBJC_ALTCCVERSION_921dbbb2=none
ARCH=powerpc64
PPC_ABI=ELFv1
OPSYS=FreeBSD
_OSRELEASE=12.1-RELEASE-p10
OSREL=12.1
OSVERSION=1201000
PYTHONBASE=/usr/local
CONFIGURE_MAX_CMD_LEN=524288
HAVE_PORTS_ENV=1
#### Misc Poudriere ####
GID=0
UID=0
---End make.conf---
--Resource limits--
cpu time               (seconds, -t)  unlimited
file size           (512-blocks, -f)  unlimited
data seg size           (kbytes, -d)  33554432
stack size              (kbytes, -s)  524288
core file size      (512-blocks, -c)  unlimited
max memory size         (kbytes, -m)  unlimited
locked memory           (kbytes, -l)  unlimited
max user processes              (-u)  89999
open files                      (-n)  1024
virtual mem size        (kbytes, -v)  unlimited
swap limit              (kbytes, -w)  unlimited
socket buffer size       (bytes, -b)  unlimited
pseudo-terminals                (-p)  unlimited
kqueues                         (-k)  unlimited
umtx shared locks               (-o)  unlimited
--End resource limits--
=======================<phase: check-sanity   >============================
===>  License LGPL21 accepted by the user
===========================================================================
=======================<phase: pkg-depends    >============================
===>   ocaml-opam-2.0.6_1 depends on file: /usr/local/sbin/pkg - not found
===>   Installing existing package /packages/All/pkg-1.15.10.txz
[121powerpc64-quarterly-job-02] Installing pkg-1.15.10...
[121powerpc64-quarterly-job-02] Extracting pkg-1.15.10: .......... done
===>   ocaml-opam-2.0.6_1 depends on file: /usr/local/sbin/pkg - found
===>   Returning to build of ocaml-opam-2.0.6_1
===========================================================================
=======================<phase: fetch-depends  >============================
===========================================================================
=======================<phase: fetch          >============================
===>  License LGPL21 accepted by the user
===> Fetching all distfiles required by ocaml-opam-2.0.6_1 for building
===========================================================================
=======================<phase: checksum       >============================
===>  License LGPL21 accepted by the user
===> Fetching all distfiles required by ocaml-opam-2.0.6_1 for building
=> SHA256 Checksum OK for opam-full-2.0.6.tar.gz.
===========================================================================
=======================<phase: extract-depends>============================
===>   ocaml-opam-2.0.6_1 depends on file: /usr/local/bin/ocamlc - not found
===>   Installing existing package /packages/All/ocaml-4.05.0_1.txz
[121powerpc64-quarterly-job-02] Installing ocaml-4.05.0_1...
[121powerpc64-quarterly-job-02] `-- Installing gcc9-9.3.0_1...
[121powerpc64-quarterly-job-02] |   `-- Installing binutils-2.33.1_4,1...
[121powerpc64-quarterly-job-02] |   | `-- Installing gettext-runtime-0.21...
[121powerpc64-quarterly-job-02] |   |   `-- Installing indexinfo-0.3.1...
[121powerpc64-quarterly-job-02] |   |   `-- Extracting indexinfo-0.3.1: .... done
[121powerpc64-quarterly-job-02] |   | `-- Extracting gettext-runtime-0.21: .......... done
[121powerpc64-quarterly-job-02] |   `-- Extracting binutils-2.33.1_4,1: .......... done
[121powerpc64-quarterly-job-02] |   `-- Installing gmp-6.2.0...
[121powerpc64-quarterly-job-02] |   `-- Extracting gmp-6.2.0: .......... done
[121powerpc64-quarterly-job-02] |   `-- Installing mpc-1.1.0_2...
[121powerpc64-quarterly-job-02] |   | `-- Installing mpfr-4.1.0...
[121powerpc64-quarterly-job-02] |   | `-- Extracting mpfr-4.1.0: .......... done
[121powerpc64-quarterly-job-02] |   `-- Extracting mpc-1.1.0_2: ......... done
[121powerpc64-quarterly-job-02] `-- Extracting gcc9-9.3.0_1: .......... done
[121powerpc64-quarterly-job-02] `-- Installing libX11-1.6.12,1...
[121powerpc64-quarterly-job-02] |   `-- Installing libxcb-1.14_1...
[121powerpc64-quarterly-job-02] |   | `-- Installing libXau-1.0.9...
[121powerpc64-quarterly-job-02] |   | `-- Extracting libXau-1.0.9: .......... done
[121powerpc64-quarterly-job-02] |   | `-- Installing libXdmcp-1.1.3...
[121powerpc64-quarterly-job-02] |   |   `-- Installing xorgproto-2020.1...
[121powerpc64-quarterly-job-02] |   |   `-- Extracting xorgproto-2020.1: .......... done
[121powerpc64-quarterly-job-02] |   | `-- Extracting libXdmcp-1.1.3: ......... done
[121powerpc64-quarterly-job-02] |   | `-- Installing libpthread-stubs-0.4...
[121powerpc64-quarterly-job-02] |   | `-- Extracting libpthread-stubs-0.4: .... done
[121powerpc64-quarterly-job-02] |   `-- Extracting libxcb-1.14_1: .......... done
<snip>
Hunk #1 succeeded at 1.
done
Hmm...  Looks like a unified diff to me...
The text leading up to this was:
--------------------------
|From bb10c2537b740fe5ab4eacc5323132df89e58b62 Mon Sep 17 00:00:00 2001
|From: Damien Doligez <damien.doligez@inria.fr>
|Date: Wed, 22 Nov 2017 15:40:35 +0100
|Subject: [PATCH] fixes for 4.06 safe-string
|
|---
| common/criteria_lexer.mll | 4 ++--
| common/input.ml           | 2 +-
| 2 files changed, 3 insertions(+), 3 deletions(-)
|
|diff --git a/common/criteria_lexer.mll b/common/criteria_lexer.mll
|index 71f9178..5518fa0 100644
|--- a/common/criteria_lexer.mll
|+++ b/common/criteria_lexer.mll
--------------------------
Patching file common/criteria_lexer.mll using Plan A...
Hunk #1 succeeded at 18.
Hunk #2 succeeded at 27.
Hmm...  The next patch looks like a unified diff to me...
The text leading up to this was:
--------------------------
|diff --git a/common/input.ml b/common/input.ml
|index ea189de..e25ca99 100644
|--- a/common/input.ml
|+++ b/common/input.ml
--------------------------
Patching file common/input.ml using Plan A...
Hunk #1 succeeded at 42.
Hmm...  Ignoring the trailing garbage.
done
rm -rf mccs
Hmm...  Looks like a unified diff to me...
The text leading up to this was:
--------------------------
|diff -Naur ocamlgraph-1.8.7/src/imperative.ml ocamlgraph/src/imperative.ml
|--- ocamlgraph-1.8.7/src/imperative.ml	2016-04-12 08:47:31.000000000 +0200
|+++ ocamlgraph/src/imperative.ml	2017-06-26 12:29:20.195718700 +0200
--------------------------
Patching file src/imperative.ml using Plan A...
Hunk #1 succeeded at 233.
Hunk #2 succeeded at 261.
Hunk #3 succeeded at 289.
Hunk #4 succeeded at 318.
Hmm...  The next patch looks like a unified diff to me...
The text leading up to this was:
--------------------------
|diff -Naur ocamlgraph-1.8.7/src/persistent.ml ocamlgraph/src/persistent.ml
|--- ocamlgraph-1.8.7/src/persistent.ml	2016-04-12 08:47:31.000000000 +0200
|+++ ocamlgraph/src/persistent.ml	2017-06-26 12:29:20.204618600 +0200
--------------------------
Patching file src/persistent.ml using Plan A...
Hunk #1 succeeded at 209.
Hunk #2 succeeded at 238.
Hunk #3 succeeded at 267.
Hunk #4 succeeded at 296.
done
rm -f seq/src/seq.ml seq/src/seq.mli
rm -rf dune-local
rm dune-local.download
gmake[2]: Leaving directory '/wrkdirs/usr/ports/devel/ocaml-opam/work/opam-full-2.0.6/src_ext'
cd src_ext/dune-local && ocaml bootstrap.ml && ./boot.exe --release
'/usr/local/bin/ocamllex.opt' -q src/meta_lexer.mll
'/usr/local/bin/ocamllex.opt' -q src/dune_lexer.mll
'/usr/local/bin/ocamllex.opt' -q src/dune_lang/dune_lexer.mll
'/usr/local/bin/ocamldep.opt' -modules src/action.ml src/action_ast.ml src/action_dune_lang.ml src/action_exec.ml src/action_intf.ml src/action_to_sh.boot.ml src/action_unexpanded.ml src/arg_spec.ml src/artifacts.ml src/binary_kind.ml src/bindings.ml src/blang.ml src/build.ml src/build_interpret.ml src/build_system.ml src/check_rules.ml src/clflags.ml src/cm_kind.ml src/colors.ml src/compilation_context.ml src/config.ml src/context.ml src/dep_graph.ml src/dep_path.ml src/deps.ml src/dir_contents.ml src/dir_status.ml src/dir_with_dune.ml src/dune_env.ml src/dune_file.ml src/dune_fmt.ml src/dune_lexer.ml src/dune_load.ml src/dune_project.ml vendor/boot/dune_re.ml src/dynlink_supported.ml src/env_node.ml src/errors.ml src/exe.ml src/exe_rules.ml src/expander.ml src/file_bindings.ml src/file_tree.ml src/findlib.ml src/format_rules.ml src/gen_meta.ml src/gen_rules.ml src/glob.ml src/glob_lexer.boot.ml src/hooks.ml src/import.ml src/inline_tests.boot.ml src/install.ml src/install_rules.ml 
 src/installed_dune_file.ml src/js_of_ocaml_rules.boot.ml src/lib.ml src/lib_archives.ml src/lib_deps_info.ml src/lib_file_deps.ml src/lib_info.ml src/lib_modules.ml src/lib_name.ml src/lib_rules.ml src/link_time_code_gen.ml src/local_package.ml src/log.ml src/main.ml src/menhir.boot.ml src/merlin.ml src/meta.ml src/meta_lexer.ml src/ml_kind.ml src/mode.ml src/module.ml src/module_compilation.ml src/modules_field_evaluator.ml src/ocaml_flags.ml src/ocaml_version.ml src/ocamldep.ml src/odoc.boot.ml vendor/boot/opamBaseParser.ml vendor/boot/opamLexer.ml vendor/boot/opamParserTypes.ml src/opam_file.ml src/ordered_set_lang.ml src/package.ml src/path_dune_lang.ml src/per_item.ml src/pform.ml src/predicate_lang.ml src/preprocessing.ml src/print_diff.ml src/process.ml src/promotion.ml src/report_error.ml src/response_file.ml src/scheduler.ml src/scope.ml src/setup.boot.ml src/simple_rules.ml src/spawn.ml src/stanza.ml src/static_deps.ml src/stats.ml src/string_with_vars.ml src/sub_dirs.ml s
 rc/sub_system.ml src/sub_system_intf.ml src/!
 sub_system_name.ml src/super_context.ml src/syntax.ml src/test_rules.ml src/top_closure.ml src/utils.ml src/utop.ml src/value.ml src/variant.ml src/versioned_file.ml src/vfile_kind.ml src/vimpl.ml src/virtual_rules.ml src/watermarks.ml src/workspace.ml > boot-depends.txt
'/usr/local/bin/ocamldep.opt' -modules src/stdune/caml/dune_caml.ml src/stdune/caml/result.ml src/stdune/caml/result_compat.ml > boot-depends.txt
'/usr/local/bin/ocamldep.opt' -modules src/dune_lang/dune_lang.ml src/dune_lang/atom.ml src/dune_lang/dune_lexer.ml src/dune_lang/escape.ml src/dune_lang/jbuild_lexer.boot.ml src/dune_lang/lexer.ml src/dune_lang/lexer_shared.ml src/dune_lang/syntax.ml src/dune_lang/template.ml src/dune_lang/types.ml > boot-depends.txt
'/usr/local/bin/ocamldep.opt' -modules src/fiber/fiber.ml > boot-depends.txt
'/usr/local/bin/ocamldep.opt' -modules src/ocaml-config/ocaml_config.ml > boot-depends.txt
'/usr/local/bin/ocamldep.opt' -modules src/stdune/stdune.ml src/stdune/ansi_color.ml src/stdune/array.ml src/stdune/bin.ml src/stdune/bool.ml src/stdune/bytes.ml src/stdune/char.ml src/stdune/common.ml src/stdune/comparable.ml src/stdune/either.ml src/stdune/env.ml src/stdune/escape.ml src/stdune/exn.ml src/stdune/filename.ml src/stdune/float.ml src/stdune/fmt.ml src/stdune/hashable.ml src/stdune/hashtbl.ml src/stdune/hashtbl_intf.ml src/stdune/import.ml src/stdune/int.ml src/stdune/interned.ml src/stdune/io.ml src/stdune/list.ml src/stdune/loc.ml src/stdune/map.ml src/stdune/map_intf.ml src/stdune/nothing.ml src/stdune/option.ml src/stdune/or_exn.ml src/stdune/ordering.ml src/stdune/path.ml src/stdune/pp.ml src/stdune/proc.ml src/stdune/result.ml src/stdune/set.ml src/stdune/set_intf.ml src/stdune/sexp.ml src/stdune/sexp_intf.ml src/stdune/staged.ml src/stdune/string.ml src/stdune/type_eq.ml src/stdune/univ_map.ml > boot-depends.txt
'/usr/local/bin/ocamldep.opt' -modules src/which_program/which_program.boot.ml > boot-depends.txt
'/usr/local/bin/ocamldep.opt' -modules src/xdg/xdg.ml > boot-depends.txt
'/usr/local/bin/ocamllex.opt' -q src/let-syntax/lexer.mll
'/usr/local/bin/ocamlc.opt' -g -w -40 -o boot.exe unix.cma threads.cma -I +threads boot.ml
src_ext/dune-local/_build_bootstrap/install/default/bin/dune build --profile=release  opam-installer.install opam.install
       ocaml src_ext/extlib/src/compat-level
sh: ocamlfind: not found
      ocamlc src_ext/ocamlgraph/src/.graph.objs/graph__Dot_lexer.{cmi,cmo,cmt}
File "src/dot_lexer.mll", line 38, characters 21-37:
Warning 3: deprecated: String.lowercase
Use String.lowercase_ascii instead.
      ocamlc src_ext/mccs/src/glpk/wclique1.o
src_ext/mccs/src/glpk/misc/wclique1.c: In function '_glp_wclique1':
src_ext/mccs/src/glpk/misc/wclique1.c:121:7: warning: 'memset' specified bound between 18446744071562067968 and 18446744073709551615 exceeds maximum object size 9223372036854775807 [-Wstringop-overflow=]
src_ext/mccs/src/glpk/misc/wclique1.c:123:7: warning: 'memset' specified bound between 18446744071562067968 and 18446744073709551615 exceeds maximum object size 9223372036854775807 [-Wstringop-overflow=]
    ocamlopt src_ext/ocamlgraph/src/.graph.objs/graph__Dot_lexer.{cmx,o}
File "src/dot_lexer.mll", line 38, characters 21-37:
Warning 3: deprecated: String.lowercase
Use String.lowercase_ascii instead.
    ocamlopt src_ext/cmdliner/src/.cmdliner.objs/cmdliner_base.{cmx,o}
File "src_ext/cmdliner/src/cmdliner_base.ml", line 14, characters 16-32:
Warning 3: deprecated: String.lowercase
Use String.lowercase_ascii instead.
File "src_ext/cmdliner/src/cmdliner_base.ml", line 15, characters 16-32:
Warning 3: deprecated: String.lowercase
Use String.lowercase_ascii instead.
File "src_ext/cmdliner/src/cmdliner_base.ml", line 16, characters 17-34:
Warning 3: deprecated: String.capitalize
Use String.capitalize_ascii instead.
    ocamlopt src_ext/cppo/src/.cppo_main.eobjs/cppo_eval.{cmx,o}
File "src_ext/cppo/src/cppo_eval.ml", line 88, characters 2-19:
Warning 3: deprecated: String.capitalize
Use String.capitalize_ascii instead.
    ocamlopt src_ext/extlib/src/.extlib.objs/extHashtbl.{cmx,o}
File "src_ext/extlib/src/extHashtbl.ml", line 26, characters 2-90:
Warning 3: deprecated: [@@noalloc] should be used instead of "noalloc"
    ocamlopt src_ext/dose3/common/.common.objs/common__Util.{cmx,o}
File "src_ext/dose3/common/util.ml", line 90, characters 6-23:
Warning 3: deprecated: String.capitalize
Use String.capitalize_ascii instead.
        opam doc/man/opam-admin-add-constraint.{1,err} (exit 1)
(cd _build/default/doc/man && ../../../install/default/bin/opam admin add-constraint --help=groff) > _build/default/doc/man/opam-admin-add-constraint.1 2> _build/default/doc/man/opam-admin-add-constraint.err
        opam doc/man/opam-admin-add-hashes.{1,err} (exit 1)
(cd _build/default/doc/man && ../../../install/default/bin/opam admin add-hashes --help=groff) > _build/default/doc/man/opam-admin-add-hashes.1 2> _build/default/doc/man/opam-admin-add-hashes.err
        opam doc/man/opam-admin-cache.{1,err} (exit 1)
(cd _build/default/doc/man && ../../../install/default/bin/opam admin cache --help=groff) > _build/default/doc/man/opam-admin-cache.1 2> _build/default/doc/man/opam-admin-cache.err
        opam doc/man/opam-admin-check.{1,err} (exit 1)
(cd _build/default/doc/man && ../../../install/default/bin/opam admin check --help=groff) > _build/default/doc/man/opam-admin-check.1 2> _build/default/doc/man/opam-admin-check.err
        opam doc/man/opam-admin-filter.{1,err} (exit 1)
(cd _build/default/doc/man && ../../../install/default/bin/opam admin filter --help=groff) > _build/default/doc/man/opam-admin-filter.1 2> _build/default/doc/man/opam-admin-filter.err
        opam doc/man/opam-admin-help.{1,err} (exit 1)
(cd _build/default/doc/man && ../../../install/default/bin/opam admin help --help=groff) > _build/default/doc/man/opam-admin-help.1 2> _build/default/doc/man/opam-admin-help.err
        opam doc/man/opam-admin-index.{1,err} (exit 1)
(cd _build/default/doc/man && ../../../install/default/bin/opam admin index --help=groff) > _build/default/doc/man/opam-admin-index.1 2> _build/default/doc/man/opam-admin-index.err
        opam doc/man/opam-admin-lint.{1,err} (exit 1)
(cd _build/default/doc/man && ../../../install/default/bin/opam admin lint --help=groff) > _build/default/doc/man/opam-admin-lint.1 2> _build/default/doc/man/opam-admin-lint.err
        opam doc/man/opam-admin-list.{1,err} (exit 1)
(cd _build/default/doc/man && ../../../install/default/bin/opam admin list --help=groff) > _build/default/doc/man/opam-admin-list.1 2> _build/default/doc/man/opam-admin-list.err
        opam doc/man/opam-admin-make.{1,err} (exit 1)
(cd _build/default/doc/man && ../../../install/default/bin/opam admin make --help=groff) > _build/default/doc/man/opam-admin-make.1 2> _build/default/doc/man/opam-admin-make.err
        opam doc/man/opam-admin-upgrade.{1,err} (exit 1)
(cd _build/default/doc/man && ../../../install/default/bin/opam admin upgrade --help=groff) > _build/default/doc/man/opam-admin-upgrade.1 2> _build/default/doc/man/opam-admin-upgrade.err
        opam doc/man/opam-admin.{1,err} (exit 1)
(cd _build/default/doc/man && ../../../install/default/bin/opam admin --help=groff) > _build/default/doc/man/opam-admin.1 2> _build/default/doc/man/opam-admin.err
        opam doc/man/opam-clean.{1,err} (exit 1)
(cd _build/default/doc/man && ../../../install/default/bin/opam clean --help=groff) > _build/default/doc/man/opam-clean.1 2> _build/default/doc/man/opam-clean.err
        opam doc/man/opam-config.{1,err} (exit 1)
(cd _build/default/doc/man && ../../../install/default/bin/opam config --help=groff) > _build/default/doc/man/opam-config.1 2> _build/default/doc/man/opam-config.err
        opam doc/man/opam-env.{1,err} (exit 1)
(cd _build/default/doc/man && ../../../install/default/bin/opam env --help=groff) > _build/default/doc/man/opam-env.1 2> _build/default/doc/man/opam-env.err
        opam doc/man/opam-exec.{1,err} (exit 1)
(cd _build/default/doc/man && ../../../install/default/bin/opam exec --help=groff) > _build/default/doc/man/opam-exec.1 2> _build/default/doc/man/opam-exec.err
        opam doc/man/opam-help.{1,err} (exit 1)
(cd _build/default/doc/man && ../../../install/default/bin/opam help --help=groff) > _build/default/doc/man/opam-help.1 2> _build/default/doc/man/opam-help.err
        opam doc/man/opam-info.{1,err} (exit 1)
(cd _build/default/doc/man && ../../../install/default/bin/opam info --help=groff) > _build/default/doc/man/opam-info.1 2> _build/default/doc/man/opam-info.err
        opam doc/man/opam-init.{1,err} (exit 1)
(cd _build/default/doc/man && ../../../install/default/bin/opam init --help=groff) > _build/default/doc/man/opam-init.1 2> _build/default/doc/man/opam-init.err
        opam doc/man/opam-install.{1,err} (exit 1)
(cd _build/default/doc/man && ../../../install/default/bin/opam install --help=groff) > _build/default/doc/man/opam-install.1 2> _build/default/doc/man/opam-install.err
        opam doc/man/opam-lint.{1,err} (exit 1)
(cd _build/default/doc/man && ../../../install/default/bin/opam lint --help=groff) > _build/default/doc/man/opam-lint.1 2> _build/default/doc/man/opam-lint.err
        opam doc/man/opam-list.{1,err} (exit 1)
(cd _build/default/doc/man && ../../../install/default/bin/opam list --help=groff) > _build/default/doc/man/opam-list.1 2> _build/default/doc/man/opam-list.err
        opam doc/man/opam-pin.{1,err} (exit 1)
(cd _build/default/doc/man && ../../../install/default/bin/opam pin --help=groff) > _build/default/doc/man/opam-pin.1 2> _build/default/doc/man/opam-pin.err
        opam doc/man/opam-reinstall.{1,err} (exit 1)
(cd _build/default/doc/man && ../../../install/default/bin/opam reinstall --help=groff) > _build/default/doc/man/opam-reinstall.1 2> _build/default/doc/man/opam-reinstall.err
        opam doc/man/opam-remote.{1,err} (exit 1)
(cd _build/default/doc/man && ../../../install/default/bin/opam remote --help=groff) > _build/default/doc/man/opam-remote.1 2> _build/default/doc/man/opam-remote.err
        opam doc/man/opam-remove.{1,err} (exit 1)
(cd _build/default/doc/man && ../../../install/default/bin/opam remove --help=groff) > _build/default/doc/man/opam-remove.1 2> _build/default/doc/man/opam-remove.err
        opam doc/man/opam-repository.{1,err} (exit 1)
(cd _build/default/doc/man && ../../../install/default/bin/opam repository --help=groff) > _build/default/doc/man/opam-repository.1 2> _build/default/doc/man/opam-repository.err
        opam doc/man/opam-show.{1,err} (exit 1)
(cd _build/default/doc/man && ../../../install/default/bin/opam show --help=groff) > _build/default/doc/man/opam-show.1 2> _build/default/doc/man/opam-show.err
        opam doc/man/opam-source.{1,err} (exit 1)
(cd _build/default/doc/man && ../../../install/default/bin/opam source --help=groff) > _build/default/doc/man/opam-source.1 2> _build/default/doc/man/opam-source.err
        opam doc/man/opam-search.{1,err} (exit 1)
(cd _build/default/doc/man && ../../../install/default/bin/opam search --help=groff) > _build/default/doc/man/opam-search.1 2> _build/default/doc/man/opam-search.err
        opam doc/man/opam-switch.{1,err} (exit 1)
(cd _build/default/doc/man && ../../../install/default/bin/opam switch --help=groff) > _build/default/doc/man/opam-switch.1 2> _build/default/doc/man/opam-switch.err
        opam doc/man/opam-uninstall.{1,err} (exit 1)
(cd _build/default/doc/man && ../../../install/default/bin/opam uninstall --help=groff) > _build/default/doc/man/opam-uninstall.1 2> _build/default/doc/man/opam-uninstall.err
        opam doc/man/opam-update.{1,err} (exit 1)
(cd _build/default/doc/man && ../../../install/default/bin/opam update --help=groff) > _build/default/doc/man/opam-update.1 2> _build/default/doc/man/opam-update.err
        opam doc/man/opam-unpin.{1,err} (exit 1)
(cd _build/default/doc/man && ../../../install/default/bin/opam unpin --help=groff) > _build/default/doc/man/opam-unpin.1 2> _build/default/doc/man/opam-unpin.err
        opam doc/man/opam-upgrade.{1,err} (exit 1)
(cd _build/default/doc/man && ../../../install/default/bin/opam upgrade --help=groff) > _build/default/doc/man/opam-upgrade.1 2> _build/default/doc/man/opam-upgrade.err
        opam doc/man/opam-var.{1,err} (exit 1)
(cd _build/default/doc/man && ../../../install/default/bin/opam var --help=groff) > _build/default/doc/man/opam-var.1 2> _build/default/doc/man/opam-var.err
    dune_man doc/man/opam-admin-topics.inc
ld-elf.so.1: /usr/lib/libstdc++.so.6: version GLIBCXX_3.4.21 required by /wrkdirs/usr/ports/devel/ocaml-opam/work/opam-full-2.0.6/_build/install/default/bin/opam not found
    dune_man doc/man/opam-topics.inc
ld-elf.so.1: /usr/lib/libstdc++.so.6: version GLIBCXX_3.4.21 required by /wrkdirs/usr/ports/devel/ocaml-opam/work/opam-full-2.0.6/_build/install/default/bin/opam not found
        opam doc/man/opam.1 (exit 1)
(cd _build/default/doc/man && ../../../install/default/bin/opam --help=groff) > _build/default/doc/man/opam.1
ld-elf.so.1: /usr/lib/libstdc++.so.6: version GLIBCXX_3.4.21 required by /wrkdirs/usr/ports/devel/ocaml-opam/work/opam-full-2.0.6/_build/default/src/client/opamMain.exe not found
gmake[1]: *** [Makefile:114: build-opam] Error 1
gmake[1]: Leaving directory '/wrkdirs/usr/ports/devel/ocaml-opam/work/opam-full-2.0.6'
*** Error code 1

Stop.
make: stopped in /usr/ports/devel/ocaml-opam



Want to link to this message? Use this URL: <http://docs.FreeBSD.org/cgi/mid.cgi?000000000000d9174b05b80d13b4>