Skip site navigation (1)Skip section navigation (2)
Date:      Wed, 20 Apr 2011 21:24:40 +0400
From:      =?koi8-r?B?59XM0cXXIOfP28E=?= <>
Subject:   libreoffice not builds (sorry for codepage problem)
Message-ID:  <>

Next in thread | Raw E-Mail | Index | Archive | Help

Hi all! I'm try to install editors/libreoffice on my machine:
OS: 8.2-STABLE FreeBSD 8.2-STABLE #0: Wed Apr 20 15:18:53 YEKST 2011 i386
ls /var/db/pkg | grep jdk
RAM: 2Gb + 4Gb swap file
Hard disk space 29Gb
I'm try disable all options, and try enable KDE + JAVA and KDE w/o JAVA.
there is output of error:
Entering /var/XXX/libreoffice-build-

Making: sdbc_hsqldb.dpj

dmake: Executing shell macro: cd $(MISC)/registry/data/org/openoffice/Office/DataAccess && ls *.xcu
/usr/local/jdk1.6.0/bin/javac -source 1.5 -target 1.5 -classpath ".:../../../../../../" -d ../../../../../../ @/tmp/mkUcfJf6
terminate called after throwing an instance of 'com::sun::star::lang::IllegalArgumentException'
/usr/local/bin/bash: line 1: 2894 Abort trap: 6 LD_LIBRARY_PATH=${LD_LIBRARY_PATH+${LD_LIBRARY_PATH}:}/var/XXX/libreoffice-build- /var/XXX/libreoffice-build- ../../
dmake: Error code 134, while making 'test1'
Making: sdbc_hsqldb.dpj

echo "Class-Path: hsqldb.jar .." >> ../../../../../../
updating: META-INF/MANIFEST.MF (deflated 7%)
updating: com/sun/star/sdbcx/comp/hsqldb/NativeInputStreamHelper.class (deflated 55%)
updating: com/sun/star/sdbcx/comp/hsqldb/StorageNativeInputStream.class (deflated 51%)
updating: com/sun/star/sdbcx/comp/hsqldb/NativeOutputStreamHelper.class (deflated 56%)
updating: com/sun/star/sdbcx/comp/hsqldb/StorageNativeOutputStream.class (deflated 50%)
updating: com/sun/star/sdbcx/comp/hsqldb/NativeStorageAccess.class (deflated 53%)
updating: com/sun/star/sdbcx/comp/hsqldb/StorageAccess.class (deflated 54%)
updating: com/sun/star/sdbcx/comp/hsqldb/StorageFileAccess$FileSync.class (deflated 52%)
updating: com/sun/star/sdbcx/comp/hsqldb/StorageFileAccess.class (deflated 57%)
updating: com/sun/star/sdbcx/comp/hsqldb/NativeLibraries.class (deflated 46%)
updating: org/hsqldb/lib/FileSystemRuntimeException.class (deflated 48%)
connectivity deliver
Module 'connectivity' delivered successfully. 0 files copied, 115 files unchanged

 Oh dear - something failed during the build - sorry !
 For more help with debugging build errors, please see the section in:

 internal build errors:

ERROR: error 65280 occurred while making /var/XXX/libreoffice-build-
ERROR: error 65280 occurred while making /var/XXX/libreoffice-build-

 it seems you are using a threaded build, which means that the
 actual compile error is probably hidden far above, and could be
 inside any of these other modules:
 please re-run build inside each one to isolate the problem.

cd /var/XXX/libreoffice-build-
source ./
cd pyuno

when the problem is isolated and fixed exit and re-run 'make' from the top-level
sometimes (sadly) it is necessary to rm -Rf in a module.
gmake: *** [stamp/build] Ошибка 1
*** Error code 1

Stop in /usr/ports/editors/libreoffice.
*** Error code 1

Stop in /usr/ports/editors/libreoffice.

 С уважением, Гуляев Гоша.

Want to link to this message? Use this URL: <>