Skip site navigation (1)Skip section navigation (2)

freebsd-java

Messages: 575, new messages first.
Last update: Sat Jul 2 16:28:55 2022

Up | Home | Archive Sorted by: Subject | Author | Date | Reverse Date
  1. Jul  2 pkg-fallout@FreeBSD [package - 130arm64-default][java/openjdk17-jre] Fai
  2. Jul  2 pkg-fallout@FreeBSD [package - 123arm64-quarterly][java/openjdk17-jre] F
  3. Jul  2 pkg-fallout@FreeBSD [package - 123i386-default][java/openjdk18] Failed f
  4. Jul  1 pkg-fallout@FreeBSD [package - 130arm64-default][java/openjdk18] Failed 
  5. Jul  1 pkg-fallout@FreeBSD [package - 123arm64-quarterly][java/openjdk13] Faile
  6. Jul  1 pkg-fallout@FreeBSD [package - 123arm64-quarterly][java/openjdk17] Faile
  7. Jul  1 pkg-fallout@FreeBSD [package - 130arm64-default][java/openjdk17] Failed 
  8. Jun 30 pkg-fallout@FreeBSD [package - main-arm64-default][java/openjdk17-jre] F
  9. Jun 30 pkg-fallout@FreeBSD [package - 130arm64-quarterly][java/openjdk17-jre] F
 10. Jun 30 pkg-fallout@FreeBSD [package - main-arm64-default][java/openjdk18] Faile
 11. Jun 30 pkg-fallout@FreeBSD [package - 130arm64-quarterly][java/openjdk13] Faile
 12. Jun 30 pkg-fallout@FreeBSD [package - 130arm64-quarterly][java/openjdk17] Faile
 13. Jun 29 pkg-fallout@FreeBSD [package - main-arm64-default][java/openjdk17] Faile
 14. Jun 29 pkg-fallout@FreeBSD [package - 130i386-default][java/openjdk18] Failed f
 15. Jun 29 pkg-fallout@FreeBSD [package - main-i386-default][java/openjdk18] Failed
 16. Jun 28 =?UTF-8?Q?S=c3=a9rg games/jinput: unbreak
 17. Jun 26 bugzilla-noreply@Fr Problem reports for java@FreeBSD.org that need speci
 18. Jun 26 pkg-fallout@FreeBSD [package - 123arm64-quarterly][java/openjdk17-jre] F
 19. Jun 26 pkg-fallout@FreeBSD [package - 123arm64-quarterly][java/openjdk13] Faile
 20. Jun 26 pkg-fallout@FreeBSD [package - 123arm64-quarterly][java/openjdk17] Faile


21. Jun 26 pkg-fallout@FreeBSD [package - 130arm64-default][java/openjdk17-jre] Fai 22. Jun 26 pkg-fallout@FreeBSD [package - 123i386-default][java/openjdk18] Failed f 23. Jun 26 pkg-fallout@FreeBSD [package - 130arm64-default][java/openjdk18] Failed 24. Jun 25 pkg-fallout@FreeBSD [package - 130i386-default][java/openjdk18] Failed f 25. Jun 25 pkg-fallout@FreeBSD [package - main-i386-default][java/openjdk18] Failed 26. Jun 25 pkg-fallout@FreeBSD [package - 130arm64-default][java/openjdk17] Failed 27. Jun 25 pkg-fallout@FreeBSD [package - 130arm64-quarterly][java/openjdk17-jre] F 28. Jun 25 pkg-fallout@FreeBSD [package - 130arm64-quarterly][java/openjdk13] Faile 29. Jun 25 pkg-fallout@FreeBSD [package - 130arm64-quarterly][java/openjdk17] Faile 30. Jun 24 pkg-fallout@FreeBSD [package - main-arm64-default][java/openjdk17-jre] F 31. Jun 24 bugzilla-noreply@fr [Bug 264065] java/openjdk8: Crashes on aarch64 when 32. Jun 24 bugzilla-noreply@fr [Bug 264065] java/openjdk8: Crashes on aarch64 when 33. Jun 23 pkg-fallout@FreeBSD [package - main-arm64-default][java/openjdk18] Faile 34. Jun 22 pkg-fallout@FreeBSD [package - main-arm64-default][java/openjdk17] Faile 35. Jun 22 pkg-fallout@FreeBSD [package - 123arm64-quarterly][java/openjdk17-jre] F 36. Jun 22 pkg-fallout@FreeBSD [package - 123arm64-quarterly][java/openjdk13] Faile 37. Jun 22 pkg-fallout@FreeBSD [package - 123arm64-quarterly][java/openjdk17] Faile 38. Jun 22 pkg-fallout@FreeBSD [package - main-i386-default][java/openjdk18] Failed 39. Jun 21 bugzilla-noreply@fr [Bug 264792] java/openjdk8: Add CUPS option 40. Jun 21 pkg-fallout@FreeBSD [package - 130arm64-default][java/openjdk17-jre] Fai
41. Jun 21 bugzilla-noreply@fr [Bug 264792] java/openjdk8: Add CUPS option 42. Jun 21 pkg-fallout@FreeBSD [package - 130arm64-default][java/openjdk18] Failed 43. Jun 21 pkg-fallout@FreeBSD [package - 123i386-default][java/openjdk18] Failed f 44. Jun 21 pkg-fallout@FreeBSD [package - 130i386-default][java/openjdk18] Failed f 45. Jun 21 pkg-fallout@FreeBSD [package - 130arm64-quarterly][java/openjdk17-jre] F 46. Jun 21 pkg-fallout@FreeBSD [package - 130arm64-default][java/openjdk17] Failed 47. Jun 21 pkg-fallout@FreeBSD [package - 130arm64-quarterly][java/openjdk13] Faile 48. Jun 21 pkg-fallout@FreeBSD [package - 130arm64-quarterly][java/openjdk17] Faile 49. Jun 20 bugzilla-noreply@fr [Bug 264792] java/openjdk8: Add CUPS option 50. Jun 20 bugzilla-noreply@fr [Bug 264792] [patch] java/openjdk8: new port option 51. Jun 20 bugzilla-noreply@fr maintainer-feedback requested: [Bug 264792] [patch] 52. Jun 19 bugzilla-noreply@Fr Problem reports for java@FreeBSD.org that need speci 53. Jun 19 bugzilla-noreply@fr [Bug 264065] java/openjdk8: Crashes on aarch64 when 54. Jun 18 pkg-fallout@FreeBSD [package - 130arm64-default][java/openjdk17-jre] Fai 55. Jun 18 pkg-fallout@FreeBSD [package - 123i386-default][java/openjdk18] Failed f 56. Jun 18 pkg-fallout@FreeBSD [package - 130arm64-default][java/openjdk18] Failed 57. Jun 18 pkg-fallout@FreeBSD [package - 130i386-default][java/openjdk18] Failed f 58. Jun 18 pkg-fallout@FreeBSD [package - main-i386-default][java/openjdk18] Failed 59. Jun 18 pkg-fallout@FreeBSD [package - 130arm64-default][java/openjdk17] Failed 60. Jun 17 pkg-fallout@FreeBSD [package - 123arm64-quarterly][java/openjdk17-jre] F
61. Jun 17 pkg-fallout@FreeBSD [package - 123arm64-quarterly][java/openjdk13] Faile 62. Jun 17 pkg-fallout@FreeBSD [package - 123arm64-quarterly][java/openjdk17] Faile 63. Jun 17 pkg-fallout@FreeBSD [package - main-arm64-default][java/icedtea-web] Fai 64. Jun 17 pkg-fallout@FreeBSD [package - main-arm64-default][java/openjdk17-jre] F 65. Jun 16 pkg-fallout@FreeBSD [package - main-arm64-default][java/openjdk18] Faile 66. Jun 16 pkg-fallout@FreeBSD [package - 123i386-default][java/openjdk18] Failed f 67. Jun 16 pkg-fallout@FreeBSD [package - 130arm64-default][java/openjdk17-jre] Fai 68. Jun 16 pkg-fallout@FreeBSD [package - main-i386-default][java/openjdk18] Failed 69. Jun 16 pkg-fallout@FreeBSD [package - 130arm64-default][java/openjdk18] Failed 70. Jun 16 pkg-fallout@FreeBSD [package - 130i386-default][java/openjdk18] Failed f 71. Jun 16 pkg-fallout@FreeBSD [package - 130arm64-default][java/openjdk17] Failed 72. Jun 16 pkg-fallout@FreeBSD [package - 130arm64-quarterly][java/openjdk17-jre] F 73. Jun 16 pkg-fallout@FreeBSD [package - 130arm64-quarterly][java/openjdk13] Faile 74. Jun 16 pkg-fallout@FreeBSD [package - 130arm64-quarterly][java/openjdk17] Faile 75. Jun 15 pkg-fallout@FreeBSD [package - main-arm64-default][java/openjdk17] Faile 76. Jun 14 bugzilla-noreply@fr [Bug 264663] java/openjdk17: possible to port WatchS 77. Jun 14 bugzilla-noreply@fr maintainer-feedback requested: [Bug 264663] java/ope 78. Jun 14 pkg-fallout@FreeBSD [package - 130arm64-default][java/openjdk17-jre] Fai 79. Jun 14 pkg-fallout@FreeBSD [package - 130arm64-default][java/openjdk18] Failed 80. Jun 14 pkg-fallout@FreeBSD [package - main-i386-default][java/openjdk18] Failed
81. Jun 14 pkg-fallout@FreeBSD [package - 130i386-default][java/openjdk18] Failed f 82. Jun 14 pkg-fallout@FreeBSD [package - 130arm64-default][java/openjdk17] Failed 83. Jun 13 pkg-fallout@FreeBSD [package - 123arm64-quarterly][java/openjdk17-jre] F 84. Jun 13 pkg-fallout@FreeBSD [package - 123arm64-quarterly][java/openjdk13] Faile 85. Jun 13 pkg-fallout@FreeBSD [package - 123arm64-quarterly][java/openjdk17] Faile 86. Jun 12 bugzilla-noreply@Fr Problem reports for java@FreeBSD.org that need speci 87. Jun 12 pkg-fallout@FreeBSD [package - main-i386-default][java/openjdk18] Failed 88. Jun 12 pkg-fallout@FreeBSD [package - 130arm64-quarterly][java/openjdk17-jre] F 89. Jun 12 pkg-fallout@FreeBSD [package - 130arm64-default][java/openjdk17-jre] Fai 90. Jun 12 pkg-fallout@FreeBSD [package - 130i386-default][java/openjdk18] Failed f 91. Jun 12 pkg-fallout@FreeBSD [package - 130arm64-quarterly][java/openjdk13] Faile 92. Jun 12 pkg-fallout@FreeBSD [package - 130arm64-quarterly][java/openjdk17] Faile 93. Jun 11 pkg-fallout@FreeBSD [package - 123i386-default][java/openjdk18] Failed f 94. Jun 11 pkg-fallout@FreeBSD [package - 130arm64-default][java/openjdk18] Failed 95. Jun 11 pkg-fallout@FreeBSD [package - 130arm64-default][java/openjdk17] Failed 96. Jun 11 pkg-fallout@FreeBSD [package - 130i386-default][java/openjdk18] Failed f 97. Jun 10 pkg-fallout@FreeBSD [package - main-arm64-default][java/icedtea-web] Fai 98. Jun 10 pkg-fallout@FreeBSD [package - main-arm64-default][java/openjdk17-jre] F 99. Jun 10 bugzilla-noreply@fr [Bug 259466] java/icedtea-web: Update to 1.8.8 100. Jun 9 pkg-fallout@FreeBSD [package - 123arm64-quarterly][java/openjdk17-jre] F
101. Jun 9 pkg-fallout@FreeBSD [package - main-arm64-default][java/openjdk18] Faile 102. Jun 9 pkg-fallout@FreeBSD [package - 130i386-default][java/openjdk18] Failed f 103. Jun 9 pkg-fallout@FreeBSD [package - 123arm64-quarterly][java/openjdk13] Faile 104. Jun 9 pkg-fallout@FreeBSD [package - 123arm64-quarterly][java/openjdk17] Faile 105. Jun 8 pkg-fallout@FreeBSD [package - main-arm64-default][java/openjdk17] Faile 106. Jun 8 pkg-fallout@FreeBSD [package - 130arm64-default][java/openjdk17-jre] Fai 107. Jun 8 pkg-fallout@FreeBSD [package - main-i386-default][java/openjdk18] Failed 108. Jun 8 bugzilla-noreply@fr [Bug 264065] java/openjdk8: Crashes on aarch64 when 109. Jun 8 pkg-fallout@FreeBSD [package - 130arm64-default][java/openjdk18] Failed 110. Jun 7 pkg-fallout@FreeBSD [package - 130arm64-quarterly][java/openjdk17-jre] F 111. Jun 7 pkg-fallout@FreeBSD [package - 123i386-default][java/openjdk18] Failed f 112. Jun 7 pkg-fallout@FreeBSD [package - 130arm64-default][java/openjdk17] Failed 113. Jun 7 pkg-fallout@FreeBSD [package - 130i386-default][java/openjdk18] Failed f 114. Jun 7 pkg-fallout@FreeBSD [package - 130arm64-quarterly][java/openjdk13] Faile 115. Jun 7 pkg-fallout@FreeBSD [package - 130arm64-quarterly][java/openjdk17] Faile 116. Jun 5 bugzilla-noreply@Fr Problem reports for java@FreeBSD.org that need speci 117. Jun 4 pkg-fallout@FreeBSD [package - 130i386-default][java/openjdk18] Failed f 118. Jun 4 pkg-fallout@FreeBSD [package - main-i386-default][java/openjdk18] Failed 119. Jun 4 bugzilla-noreply@fr [Bug 264065] java/openjdk8: Crashes on aarch64 when 120. Jun 3 pkg-fallout@FreeBSD [package - main-arm64-default][java/icedtea-web] Fai
121. Jun 3 pkg-fallout@FreeBSD [package - main-arm64-default][java/openjdk17-jre] F 122. Jun 3 pkg-fallout@FreeBSD [package - 123arm64-quarterly][java/openjdk17-jre] F 123. Jun 3 pkg-fallout@FreeBSD [package - 123arm64-quarterly][java/openjdk13] Faile 124. Jun 3 pkg-fallout@FreeBSD [package - 123arm64-quarterly][java/openjdk17] Faile 125. Jun 3 pkg-fallout@FreeBSD [package - 130arm64-default][java/openjdk17-jre] Fai 126. Jun 3 pkg-fallout@FreeBSD [package - main-arm64-default][java/openjdk18] Faile 127. Jun 3 pkg-fallout@FreeBSD [package - 123i386-default][java/openjdk18] Failed f 128. Jun 2 pkg-fallout@FreeBSD [package - 130arm64-default][java/openjdk18] Failed 129. Jun 2 pkg-fallout@FreeBSD [package - main-arm64-default][java/openjdk17] Faile 130. Jun 2 pkg-fallout@FreeBSD [package - 130arm64-default][java/openjdk17] Failed 131. Jun 2 pkg-fallout@FreeBSD [package - main-i386-default][java/openjdk18] Failed 132. Jun 2 pkg-fallout@FreeBSD [package - 130arm64-quarterly][java/openjdk17-jre] F 133. Jun 2 pkg-fallout@FreeBSD [package - 130arm64-quarterly][java/openjdk13] Faile 134. Jun 2 pkg-fallout@FreeBSD [package - 130arm64-quarterly][java/openjdk17] Faile 135. May 31 pkg-fallout@FreeBSD [package - 130i386-default][java/openjdk18] Failed f 136. May 31 pkg-fallout@FreeBSD [package - main-i386-default][java/openjdk18] Failed 137. May 31 pkg-fallout@FreeBSD [package - 123arm64-quarterly][java/openjdk17-jre] F 138. May 31 pkg-fallout@FreeBSD [package - 123arm64-quarterly][java/openjdk17] Faile 139. May 30 pkg-fallout@FreeBSD [package - 123arm64-quarterly][java/openjdk13] Faile 140. May 30 bugzilla-noreply@fr [Bug 264356] java/openjdk17: Exception with multi-s
141. May 30 bugzilla-noreply@fr [Bug 264356] java/openjdk17: Exception with multi-s 142. May 30 bugzilla-noreply@fr maintainer-feedback requested: [Bug 264356] java/ope 143. May 30 bugzilla-noreply@fr [Bug 264356] java/openjdk17: Exception with multi-s 144. May 29 pkg-fallout@FreeBSD [package - main-arm64-default][java/icedtea-web] Fai 145. May 29 pkg-fallout@FreeBSD [package - main-arm64-default][java/openjdk17-jre] F 146. May 29 bugzilla-noreply@Fr Problem reports for java@FreeBSD.org that need speci 147. May 29 pkg-fallout@FreeBSD [package - 130arm64-default][java/openjdk17-jre] Fai 148. May 29 pkg-fallout@FreeBSD [package - 130arm64-quarterly][java/openjdk17-jre] F 149. May 29 pkg-fallout@FreeBSD [package - 123i386-default][java/openjdk18] Failed f 150. May 29 pkg-fallout@FreeBSD [package - main-arm64-default][java/openjdk18] Faile 151. May 29 pkg-fallout@FreeBSD [package - 130arm64-default][java/openjdk18] Failed 152. May 29 pkg-fallout@FreeBSD [package - 130arm64-quarterly][java/openjdk17] Faile 153. May 29 pkg-fallout@FreeBSD [package - 130arm64-quarterly][java/openjdk13] Faile 154. May 28 pkg-fallout@FreeBSD [package - main-arm64-default][java/openjdk17] Faile 155. May 28 pkg-fallout@FreeBSD [package - 130i386-default][java/openjdk18] Failed f 156. May 28 pkg-fallout@FreeBSD [package - main-i386-default][java/openjdk18] Failed 157. May 28 pkg-fallout@FreeBSD [package - 130arm64-default][java/openjdk17] Failed 158. May 26 pkg-fallout@FreeBSD [package - 123arm64-quarterly][java/openjdk17-jre] F 159. May 26 pkg-fallout@FreeBSD [package - 123arm64-quarterly][java/openjdk13] Faile 160. May 26 pkg-fallout@FreeBSD [package - 123arm64-quarterly][java/openjdk17] Faile
161. May 24 pkg-fallout@FreeBSD [package - 130i386-default][java/openjdk18] Failed f 162. May 24 pkg-fallout@FreeBSD [package - main-i386-default][java/openjdk18] Failed 163. May 24 pkg-fallout@FreeBSD [package - 130arm64-quarterly][java/openjdk17-jre] F 164. May 24 pkg-fallout@FreeBSD [package - 130arm64-quarterly][java/openjdk13] Faile 165. May 24 bugzilla-noreply@fr [Bug 264065] java/openjdk8: Crashes on aarch64 when 166. May 24 bugzilla-noreply@fr [Bug 264165] java/jxgrabkey: Fails to build: java/op 167. May 24 pkg-fallout@FreeBSD [package - 130arm64-quarterly][java/openjdk17] Faile 168. May 23 bugzilla-noreply@fr [Bug 264065] java/openjdk8: broken on aarch64 when b 169. May 23 bugzilla-noreply@fr [Bug 264065] java/openjdk8: broken on aarch64 when b 170. May 23 bugzilla-noreply@fr [Bug 264065] java/openjdk8: java(1) dumps core on aa 171. May 23 bugzilla-noreply@fr [Bug 264165] java/openjdk8: Java crashes at build ti 172. May 23 bugzilla-noreply@fr [Bug 264065] java/openjdk8: java(1) dumps core on aa 173. May 23 bugzilla-noreply@fr [Bug 264154] java/openjdk8: JRE 8.0_332-b09 is BROKE 174. May 23 pkg-fallout@FreeBSD [package - 130arm64-default][java/openjdk17-jre] Fai 175. May 23 pkg-fallout@FreeBSD [package - 123i386-default][java/openjdk18] Failed f 176. May 23 bugzilla-noreply@fr [Bug 264165] java/openjdk8: Java crashes at build ti 177. May 23 bugzilla-noreply@fr maintainer-feedback requested: [Bug 264165] java/ope 178. May 22 bugzilla-noreply@Fr Problem reports for java@FreeBSD.org that need speci 179. May 22 pkg-fallout@FreeBSD [package - 130arm64-default][java/openjdk18] Failed 180. May 22 pkg-fallout@FreeBSD [package - main-arm64-default][java/icedtea-web] Fai
181. May 22 pkg-fallout@FreeBSD [package - main-arm64-default][java/openjdk17-jre] F 182. May 22 bugzilla-noreply@fr [Bug 264154] java/openjdk8: JRE 8.0_332-b09 is BROKE 183. May 22 bugzilla-noreply@fr maintainer-feedback requested: [Bug 264154] java/ope 184. May 22 pkg-fallout@FreeBSD [package - 130arm64-default][java/openjdk17] Failed 185. May 22 pkg-fallout@FreeBSD [package - main-arm64-default][java/openjdk18] Faile 186. May 22 pkg-fallout@FreeBSD [package - 130arm64-default][java/openjdk13] Failed 187. May 21 pkg-fallout@FreeBSD [package - main-arm64-default][java/openjdk17] Faile 188. May 21 pkg-fallout@FreeBSD [package - main-i386-default][java/openjdk18] Failed 189. May 21 pkg-fallout@FreeBSD [package - 130i386-default][java/openjdk18] Failed f 190. May 21 pkg-fallout@FreeBSD [package - main-arm64-default][java/openjdk13] Faile 191. May 20 pkg-fallout@FreeBSD [package - 123arm64-quarterly][java/openjdk17-jre] F 192. May 20 pkg-fallout@FreeBSD [package - 123arm64-quarterly][java/openjdk13] Faile 193. May 20 pkg-fallout@FreeBSD [package - 123arm64-quarterly][java/openjdk17] Faile 194. May 20 bugzilla-noreply@fr [Bug 264065] java/openjdk8: java(1) dumps core on aa 195. May 20 bugzilla-noreply@fr [Bug 264065] java/openjdk8: java(1) dumps core on aa 196. May 20 pkg-fallout@FreeBSD [package - 130arm64-default][java/openjdk17-jre] Fai 197. May 19 pkg-fallout@FreeBSD [package - 123i386-default][java/openjdk18] Failed f 198. May 19 pkg-fallout@FreeBSD [package - 130arm64-default][java/openjdk18] Failed 199. May 19 pkg-fallout@FreeBSD [package - 130i386-default][java/openjdk18] Failed f 200. May 19 bugzilla-noreply@fr [Bug 264065] java/openjdk8: java(1) dumps core on aa
201. May 19 pkg-fallout@FreeBSD [package - 130arm64-default][java/openjdk17] Failed 202. May 19 bugzilla-noreply@fr [Bug 264065] java/openjdk8: java(1) dumps core on aa 203. May 19 bugzilla-noreply@fr [Bug 260187] java/bootstrap-openjdk17: broken on aar 204. May 19 pkg-fallout@FreeBSD [package - 130arm64-default][java/openjdk13] Failed 205. May 19 pkg-fallout@FreeBSD [package - 130arm64-quarterly][java/openjdk17-jre] F 206. May 19 pkg-fallout@FreeBSD [package - 130arm64-quarterly][java/openjdk13] Faile 207. May 19 pkg-fallout@FreeBSD [package - 130arm64-quarterly][java/openjdk17] Faile 208. May 18 pkg-fallout@FreeBSD [package - main-arm64-default][java/icedtea-web] Fai 209. May 18 pkg-fallout@FreeBSD [package - main-arm64-default][java/openjdk17-jre] F 210. May 18 bugzilla-noreply@fr [Bug 264065] java/openjdk8: java(1) dumps core on aa 211. May 18 bugzilla-noreply@fr [Bug 264065] java/openjdk8: java(1) dumps core on aa 212. May 18 bugzilla-noreply@fr maintainer-feedback requested: [Bug 264065] java/ope 213. May 18 pkg-fallout@FreeBSD [package - main-i386-default][java/openjdk18] Failed 214. May 17 pkg-fallout@FreeBSD [package - main-arm64-default][java/openjdk18] Faile 215. May 17 bugzilla-noreply@fr [Bug 263483] [PATCH] Mk/bsd.java.mk: Fix JAVA_VERSIO 216. May 17 bugzilla-noreply@fr [Bug 263483] [PATCH] Mk/bsd.java.mk: Fix JAVA_VERSIO 217. May 17 pkg-fallout@FreeBSD [package - 130arm64-default][java/openjdk17-jre] Fai 218. May 17 pkg-fallout@FreeBSD [package - 123i386-default][java/openjdk18] Failed f 219. May 17 pkg-fallout@FreeBSD [package - 130arm64-default][java/openjdk18] Failed 220. May 17 pkg-fallout@FreeBSD [package - 130i386-default][java/openjdk18] Failed f
221. May 17 pkg-fallout@FreeBSD [package - 130arm64-default][java/openjdk17] Failed 222. May 17 pkg-fallout@FreeBSD [package - 130arm64-default][java/openjdk13] Failed 223. May 16 pkg-fallout@FreeBSD [package - main-arm64-default][java/openjdk17] Faile 224. May 16 pkg-fallout@FreeBSD [package - 123arm64-quarterly][java/openjdk17-jre] F 225. May 16 bugzilla-noreply@fr [Bug 260187] java/bootstrap-openjdk17: broken on aar 226. May 16 bugzilla-noreply@fr [Bug 260187] java/bootstrap-openjdk17: broken on aar 227. May 16 pkg-fallout@FreeBSD [package - main-arm64-default][java/openjdk13] Faile 228. May 16 bugzilla-noreply@fr [Bug 260187] java/bootstrap-openjdk17: broken on aar 229. May 16 pkg-fallout@FreeBSD [package - 123arm64-quarterly][java/openjdk13] Faile 230. May 16 pkg-fallout@FreeBSD [package - 123arm64-quarterly][java/openjdk17] Faile 231. May 15 bugzilla-noreply@fr [Bug 260187] java/bootstrap-openjdk17: broken on aar 232. May 15 bugzilla-noreply@Fr Problem reports for java@FreeBSD.org that need speci 233. May 15 pkg-fallout@FreeBSD [package - 130arm64-default][java/openjdk17-jre] Fai 234. May 15 pkg-fallout@FreeBSD [package - 123i386-default][java/openjdk18] Failed f 235. May 14 pkg-fallout@FreeBSD [package - 130arm64-default][java/openjdk18] Failed 236. May 14 pkg-fallout@FreeBSD [package - 130i386-default][java/openjdk18] Failed f 237. May 14 pkg-fallout@FreeBSD [package - main-i386-default][java/openjdk18] Failed 238. May 14 pkg-fallout@FreeBSD [package - 130arm64-default][java/openjdk17] Failed 239. May 14 pkg-fallout@FreeBSD [package - 130arm64-quarterly][java/openjdk17-jre] F 240. May 14 pkg-fallout@FreeBSD [package - 130arm64-default][java/openjdk13] Failed
241. May 14 pkg-fallout@FreeBSD [package - 130arm64-quarterly][java/openjdk13] Faile 242. May 14 pkg-fallout@FreeBSD [package - 130arm64-quarterly][java/openjdk17] Faile 243. May 13 Thierry Thomas Re: git: 151865636188 - main - devel/R-cran-rJava: f 244. May 13 pkg-fallout@FreeBSD [package - main-arm64-default][java/openjdk17-jre] F 245. May 12 pkg-fallout@FreeBSD [package - main-i386-default][java/openjdk18] Failed 246. May 12 pkg-fallout@FreeBSD [package - main-arm64-default][java/openjdk18] Faile 247. May 12 pkg-fallout@FreeBSD [package - 130i386-default][java/openjdk18] Failed f 248. May 11 pkg-fallout@FreeBSD [package - 130arm64-default][java/openjdk17-jre] Fai 249. May 11 pkg-fallout@FreeBSD [package - main-arm64-default][java/openjdk17] Faile 250. May 11 pkg-fallout@FreeBSD [package - 123arm64-quarterly][java/openjdk17-jre] F 251. May 11 pkg-fallout@FreeBSD [package - 123arm64-quarterly][java/openjdk13] Faile 252. May 11 pkg-fallout@FreeBSD [package - 123arm64-quarterly][java/openjdk17] Faile 253. May 11 pkg-fallout@FreeBSD [package - 130arm64-default][java/openjdk18] Failed 254. May 11 pkg-fallout@FreeBSD [package - main-arm64-default][java/openjdk13] Faile 255. May 11 pkg-fallout@FreeBSD [package - 123i386-default][java/openjdk18] Failed f 256. May 10 pkg-fallout@FreeBSD [package - 130i386-default][java/openjdk18] Failed f 257. May 10 pkg-fallout@FreeBSD [package - 130arm64-default][java/openjdk17] Failed 258. May 10 bugzilla-noreply@fr [Bug 263881] java/openjdk17-jre Exception: Thread CP 259. May 10 pkg-fallout@FreeBSD [package - 130arm64-default][java/openjdk13] Failed 260. May 10 pkg-fallout@FreeBSD [package - 130arm64-quarterly][java/openjdk17-jre] F
261. May 10 pkg-fallout@FreeBSD [package - 130arm64-quarterly][java/openjdk13] Faile 262. May 10 pkg-fallout@FreeBSD [package - 130arm64-quarterly][java/openjdk17] Faile 263. May 9 Ronald Klop Re: [package - 130arm64-default][java/openjdk17] Fai 264. May 9 bugzilla-noreply@fr [Bug 263881] java/openjdk17-jre Exception: Thread CP 265. May 9 bugzilla-noreply@fr [Bug 263881] java/openjdk17-jre Exception: Thread CP 266. May 9 bugzilla-noreply@fr maintainer-feedback requested: [Bug 263881] java/ope 267. May 9 Ronald Klop Re: [package - 130arm64-default][java/openjdk17] Fai 268. May 9 Ronald Klop Re: [package - 130arm64-default][java/openjdk17] Fai 269. May 9 pkg-fallout@FreeBSD [package - main-i386-default][java/openjdk18] Failed 270. May 9 =?UTF-8?Q?Mika=c3=a Re: [package - 130arm64-default][java/openjdk17] Fai 271. May 8 bugzilla-noreply@Fr Problem reports for java@FreeBSD.org that need speci 272. May 8 pkg-fallout@FreeBSD [package - main-arm64-default][java/openjdk8-jre] Fa 273. May 8 pkg-fallout@FreeBSD [package - main-arm64-default][java/openjdk17-jre] F 274. May 8 pkg-fallout@FreeBSD [package - 130arm64-default][java/openjdk8-jre] Fail 275. May 8 pkg-fallout@FreeBSD [package - 130arm64-default][java/openjdk17-jre] Fai 276. May 8 pkg-fallout@FreeBSD [package - 130i386-default][java/openjdk18] Failed f 277. May 7 pkg-fallout@FreeBSD [package - 123i386-default][java/openjdk18] Failed f 278. May 7 pkg-fallout@FreeBSD [package - main-arm64-default][java/openjdk18] Faile 279. May 7 pkg-fallout@FreeBSD [package - 130arm64-default][java/openjdk18] Failed 280. May 7 pkg-fallout@FreeBSD [package - main-arm64-default][java/openjdk17] Faile
281. May 7 pkg-fallout@FreeBSD [package - 130arm64-default][java/openjdk17] Failed 282. May 7 pkg-fallout@FreeBSD [package - main-i386-default][java/openjdk18] Failed 283. May 7 pkg-fallout@FreeBSD [package - 130i386-default][java/openjdk18] Failed f 284. May 7 pkg-fallout@FreeBSD [package - main-arm64-default][java/openjdk13] Faile 285. May 7 pkg-fallout@FreeBSD [package - main-arm64-default][java/openjdk8] Failed 286. May 7 pkg-fallout@FreeBSD [package - 130arm64-default][java/openjdk13] Failed 287. May 7 pkg-fallout@FreeBSD [package - 130arm64-default][java/openjdk8] Failed f 288. May 6 pkg-fallout@FreeBSD [package - 123arm64-quarterly][java/openjdk17-jre] F 289. May 6 pkg-fallout@FreeBSD [package - 123arm64-quarterly][java/openjdk13] Faile 290. May 6 pkg-fallout@FreeBSD [package - 123arm64-quarterly][java/openjdk17] Faile 291. May 6 portscout@FreeBSD.o FreeBSD ports you maintain which are out of date 292. May 5 portscout@FreeBSD.o FreeBSD ports you maintain which are out of date 293. May 5 pkg-fallout@FreeBSD [package - main-i386-default][java/openjdk18] Failed 294. May 5 pkg-fallout@FreeBSD [package - 130i386-default][java/openjdk18] Failed f 295. May 5 pkg-fallout@FreeBSD [package - main-arm64-default][java/openjdk18] Faile 296. May 5 pkg-fallout@FreeBSD [package - 130arm64-quarterly][java/openjdk17-jre] F 297. May 5 pkg-fallout@FreeBSD [package - 130arm64-quarterly][java/openjdk13] Faile 298. May 5 pkg-fallout@FreeBSD [package - 130arm64-quarterly][java/openjdk17] Faile 299. May 4 pkg-fallout@FreeBSD [package - main-arm64-default][java/openjdk17-jre] F 300. May 4 pkg-fallout@FreeBSD [package - 123i386-default][java/openjdk18] Failed f
301. May 4 pkg-fallout@FreeBSD [package - 130arm64-default][java/openjdk18] Failed 302. May 3 pkg-fallout@FreeBSD [package - main-i386-default][java/openjdk18] Failed 303. May 3 pkg-fallout@FreeBSD [package - 130i386-default][java/openjdk18] Failed f 304. May 3 pkg-fallout@FreeBSD [package - 130arm64-default][java/openjdk17-jre] Fai 305. May 3 pkg-fallout@FreeBSD [package - main-arm64-default][java/openjdk17] Faile 306. May 3 pkg-fallout@FreeBSD [package - main-arm64-default][java/openjdk13] Faile 307. May 3 pkg-fallout@FreeBSD [package - 130arm64-default][java/openjdk17] Failed 308. May 3 pkg-fallout@FreeBSD [package - 130arm64-default][java/openjdk13] Failed 309. May 2 pkg-fallout@FreeBSD [package - 123arm64-quarterly][java/openjdk17-jre] F 310. May 2 Ronald Klop Re: [package - 130arm64-default][java/openjdk17] Fai 311. May 1 pkg-fallout@FreeBSD [package - 123i386-default][java/openjdk18] Failed f 312. May 1 pkg-fallout@FreeBSD [package - 123arm64-quarterly][java/openjdk13] Faile 313. May 1 pkg-fallout@FreeBSD [package - 123arm64-quarterly][java/openjdk17] Faile 314. May 1 bugzilla-noreply@Fr Problem reports for java@FreeBSD.org that need speci 315. May 1 pkg-fallout@FreeBSD [package - 130arm64-default][java/openjdk18] Failed 316. May 1 bugzilla-noreply@fr [Bug 263483] [PATCH] Mk/bsd.java.mk: Fix JAVA_VERSIO 317. May 1 pkg-fallout@FreeBSD [package - 130arm64-default][java/openjdk17-jre] Fai 318. May 1 bugzilla-noreply@fr [Bug 263483] [PATCH] Mk/bsd.java.mk: Fix JAVA_VERSIO 319. May 1 bugzilla-noreply@fr [Bug 263483] [PATCH] Mk/bsd.java.mk: Fix JAVA_VERSIO 320. Apr 30 Greg Lewis Re: [package - 130arm64-default][java/openjdk17] Fai
321. Apr 30 bugzilla-noreply@fr [Bug 263483] [PATCH] Mk/bsd.java.mk: Fix JAVA_VERSIO 322. Apr 30 Ronald Klop Re: [package - 130arm64-default][java/openjdk17] Fai 323. Apr 30 pkg-fallout@FreeBSD [package - 130arm64-quarterly][java/openjdk17-jre] F 324. Apr 30 pkg-fallout@FreeBSD [package - 130arm64-default][java/openjdk17] Failed 325. Apr 30 pkg-fallout@FreeBSD [package - 130arm64-default][java/openjdk13] Failed 326. Apr 30 pkg-fallout@FreeBSD [package - main-i386-default][java/openjdk18] Failed 327. Apr 30 pkg-fallout@FreeBSD [package - 130i386-default][java/openjdk18] Failed f 328. Apr 30 pkg-fallout@FreeBSD [package - 130arm64-quarterly][java/openjdk13] Faile 329. Apr 30 pkg-fallout@FreeBSD [package - 130arm64-quarterly][java/openjdk17] Faile 330. Apr 29 pkg-fallout@FreeBSD [package - main-arm64-default][java/openjdk18] Faile 331. Apr 29 pkg-fallout@FreeBSD [package - main-i386-default][java/openjdk18] Failed 332. Apr 29 pkg-fallout@FreeBSD [package - 130i386-default][java/openjdk18] Failed f 333. Apr 28 pkg-fallout@FreeBSD [package - main-arm64-default][java/openjdk17-jre] F 334. Apr 28 pkg-fallout@FreeBSD [package - 123arm64-quarterly][java/openjdk17-jre] F 335. Apr 28 pkg-fallout@FreeBSD [package - 123arm64-quarterly][java/openjdk13] Faile 336. Apr 28 pkg-fallout@FreeBSD [package - 123arm64-quarterly][java/openjdk17] Faile 337. Apr 27 pkg-fallout@FreeBSD [package - main-arm64-default][java/openjdk17] Faile 338. Apr 27 pkg-fallout@FreeBSD [package - main-arm64-default][java/openjdk13] Faile 339. Apr 27 pkg-fallout@FreeBSD [package - 123i386-default][java/openjdk18] Failed f 340. Apr 27 pkg-fallout@FreeBSD [package - 130arm64-default][java/openjdk18] Failed
341. Apr 26 pkg-fallout@FreeBSD [package - main-i386-default][java/openjdk18] Failed 342. Apr 26 pkg-fallout@FreeBSD [package - 130i386-default][java/openjdk18] Failed f 343. Apr 26 pkg-fallout@FreeBSD [package - 130arm64-default][java/openjdk17-jre] Fai 344. Apr 26 pkg-fallout@FreeBSD [package - 130arm64-quarterly][java/openjdk17-jre] F 345. Apr 26 pkg-fallout@FreeBSD [package - 130arm64-default][java/openjdk13] Failed 346. Apr 26 pkg-fallout@FreeBSD [package - 130arm64-default][java/openjdk17] Failed 347. Apr 26 pkg-fallout@FreeBSD [package - 130arm64-quarterly][java/openjdk13] Faile 348. Apr 26 pkg-fallout@FreeBSD [package - 130arm64-quarterly][java/openjdk17] Faile 349. Apr 24 bugzilla-noreply@Fr Problem reports for java@FreeBSD.org that need speci 350. Apr 24 pkg-fallout@FreeBSD [package - main-i386-default][java/openjdk18] Failed 351. Apr 24 pkg-fallout@FreeBSD [package - 123i386-default][java/openjdk18] Failed f 352. Apr 24 pkg-fallout@FreeBSD [package - 130arm64-default][java/openjdk18] Failed 353. Apr 23 bugzilla-noreply@fr [Bug 263483] [PATCH] Mk/bsd.java.mk: Fix JAVA_VERSIO 354. Apr 23 bugzilla-noreply@fr [Bug 263483] [PATCH] Mk/bsd.java.mk: Fix JAVA_VERSIO 355. Apr 23 pkg-fallout@FreeBSD [package - 130i386-default][java/openjdk18] Failed f 356. Apr 23 pkg-fallout@FreeBSD [package - 130arm64-default][java/openjdk17-jre] Fai 357. Apr 23 pkg-fallout@FreeBSD [package - 123arm64-quarterly][java/openjdk17-jre] F 358. Apr 23 pkg-fallout@FreeBSD [package - 123arm64-quarterly][java/openjdk17] Faile 359. Apr 23 pkg-fallout@FreeBSD [package - 123arm64-quarterly][java/openjdk13] Faile 360. Apr 23 pkg-fallout@FreeBSD [package - 130arm64-default][java/openjdk17] Failed
361. Apr 23 bugzilla-noreply@fr [Bug 263483] [PATCH] Mk/bsd.java.mk: Fix JAVA_VERSIO 362. Apr 23 pkg-fallout@FreeBSD [package - 130arm64-default][java/openjdk13] Failed 363. Apr 22 pkg-fallout@FreeBSD [package - main-arm64-default][java/openjdk18] Faile 364. Apr 22 pkg-fallout@FreeBSD [package - main-arm64-default][java/openjdk17-jre] F 365. Apr 21 pkg-fallout@FreeBSD [package - 130arm64-quarterly][java/openjdk17-jre] F 366. Apr 21 pkg-fallout@FreeBSD [package - main-arm64-default][java/openjdk17] Faile 367. Apr 21 pkg-fallout@FreeBSD [package - main-arm64-default][java/openjdk13] Faile 368. Apr 21 pkg-fallout@FreeBSD [package - main-i386-default][java/openjdk18] Failed 369. Apr 21 pkg-fallout@FreeBSD [package - 130i386-default][java/openjdk18] Failed f 370. Apr 21 pkg-fallout@FreeBSD [package - 130arm64-quarterly][java/openjdk17] Faile 371. Apr 21 pkg-fallout@FreeBSD [package - 130arm64-quarterly][java/openjdk13] Faile 372. Apr 20 pkg-fallout@FreeBSD [package - 123i386-default][java/openjdk18] Failed f 373. Apr 20 pkg-fallout@FreeBSD [package - 130arm64-default][java/openjdk18] Failed 374. Apr 20 pkg-fallout@FreeBSD [package - 130arm64-default][java/openjdk17-jre] Fai 375. Apr 20 pkg-fallout@FreeBSD [package - main-i386-default][java/openjdk18] Failed 376. Apr 19 pkg-fallout@FreeBSD [package - 130i386-default][java/openjdk18] Failed f 377. Apr 19 pkg-fallout@FreeBSD [package - 130arm64-default][java/openjdk17] Failed 378. Apr 19 pkg-fallout@FreeBSD [package - 130arm64-default][java/openjdk13] Failed 379. Apr 18 pkg-fallout@FreeBSD [package - main-arm64-default][java/openjdk18] Faile 380. Apr 17 bugzilla-noreply@Fr Problem reports for java@FreeBSD.org that need speci
381. Apr 17 pkg-fallout@FreeBSD [package - 123arm64-quarterly][java/openjdk17-jre] F 382. Apr 17 pkg-fallout@FreeBSD [package - main-arm64-default][java/openjdk17-jre] F 383. Apr 16 pkg-fallout@FreeBSD [package - 123arm64-quarterly][java/openjdk17] Faile 384. Apr 16 pkg-fallout@FreeBSD [package - 123arm64-quarterly][java/openjdk13] Faile 385. Apr 16 pkg-fallout@FreeBSD [package - main-arm64-default][java/openjdk17] Faile 386. Apr 16 pkg-fallout@FreeBSD [package - main-arm64-default][java/openjdk13] Faile 387. Apr 16 pkg-fallout@FreeBSD [package - 123i386-default][java/openjdk18] Failed f 388. Apr 15 pkg-fallout@FreeBSD [package - 130arm64-default][java/openjdk18] Failed 389. Apr 15 pkg-fallout@FreeBSD [package - 130arm64-default][java/openjdk17-jre] Fai 390. Apr 14 bugzilla-noreply@fr [Bug 262809] java/openjdk11: builtin DTrace support 391. Apr 14 pkg-fallout@FreeBSD [package - 130arm64-default][java/openjdk17] Failed 392. Apr 14 pkg-fallout@FreeBSD [package - 130arm64-default][java/openjdk13] Failed 393. Apr 14 pkg-fallout@FreeBSD [package - 130arm64-quarterly][java/openjdk17-jre] F 394. Apr 13 pkg-fallout@FreeBSD [package - 130arm64-quarterly][java/openjdk17] Faile 395. Apr 12 pkg-fallout@FreeBSD [package - 130arm64-quarterly][java/openjdk13] Faile 396. Apr 11 pkg-fallout@FreeBSD [package - main-arm64-default][java/openjdk17-jre] F 397. Apr 11 portscout@FreeBSD.o FreeBSD ports you maintain which are out of date 398. Apr 11 pkg-fallout@FreeBSD [package - 130arm64-default][java/openjdk17-jre] Fai 399. Apr 10 bugzilla-noreply@Fr Problem reports for java@FreeBSD.org that need speci 400. Apr 10 pkg-fallout@FreeBSD [package - main-arm64-default][java/openjdk17] Faile
401. Apr 10 pkg-fallout@FreeBSD [package - main-arm64-default][java/openjdk13] Faile 402. Apr 10 pkg-fallout@FreeBSD [package - 130arm64-default][java/openjdk17] Failed 403. Apr 10 pkg-fallout@FreeBSD [package - 130arm64-default][java/openjdk13] Failed 404. Apr 9 pkg-fallout@FreeBSD [package - 123arm64-quarterly][java/openjdk17-jre] F 405. Apr 9 pkg-fallout@FreeBSD [package - 123arm64-quarterly][java/openjdk17] Faile 406. Apr 9 pkg-fallout@FreeBSD [package - 123arm64-quarterly][java/openjdk13] Faile 407. Apr 7 pkg-fallout@FreeBSD [package - main-arm64-default][java/openjdk17-jre] F 408. Apr 7 pkg-fallout@FreeBSD [package - 130arm64-quarterly][java/openjdk17-jre] F 409. Apr 6 pkg-fallout@FreeBSD [package - main-arm64-default][java/openjdk17] Faile 410. Apr 6 pkg-fallout@FreeBSD [package - 130arm64-quarterly][java/openjdk17] Faile 411. Apr 6 pkg-fallout@FreeBSD [package - main-arm64-default][java/openjdk13] Faile 412. Apr 6 pkg-fallout@FreeBSD [package - 130arm64-quarterly][java/openjdk13] Faile 413. Apr 5 pkg-fallout@FreeBSD [package - 130arm64-default][java/openjdk17-jre] Fai 414. Apr 5 pkg-fallout@FreeBSD [package - 130arm64-default][java/openjdk17] Failed 415. Apr 5 pkg-fallout@FreeBSD [package - 130arm64-default][java/openjdk13] Failed 416. Apr 4 bugzilla-noreply@fr [Bug 260319] java/openjdk11: various segfaults with 417. Apr 4 bugzilla-noreply@fr [Bug 260319] java/openjdk11: various segfaults with 418. Apr 4 bugzilla-noreply@fr [Bug 260319] java/openjdk11: various segfaults with 419. Apr 4 bugzilla-noreply@fr [Bug 262845] java/openjdk13 java/openjdk14 java/open 420. Apr 4 bugzilla-noreply@fr [Bug 260319] java/openjdk11: various segfaults with
421. Apr 4 bugzilla-noreply@fr [Bug 262845] java/openjdk13 java/openjdk14 java/open 422. Apr 4 bugzilla-noreply@fr [Bug 262845] java/openjdk13 java/openjdk14 java/open 423. Apr 4 bugzilla-noreply@fr [Bug 262845] java/openjdk13 java/openjdk14 java/open 424. Apr 4 pkg-fallout@FreeBSD [package - 123arm64-quarterly][java/openjdk17-jre] F 425. Apr 3 bugzilla-noreply@Fr Problem reports for java@FreeBSD.org that need speci 426. Apr 3 bugzilla-noreply@fr [Bug 262845] java/openjdk13 java/openjdk14 java/open 427. Apr 3 pkg-fallout@FreeBSD [package - 123arm64-quarterly][java/openjdk17] Faile 428. Apr 2 pkg-fallout@FreeBSD [package - 123arm64-quarterly][java/openjdk13] Faile 429. Apr 2 pkg-fallout@FreeBSD [package - main-arm64-default][java/openjdk17-jre] F 430. Apr 1 bugzilla-noreply@fr [Bug 262681] java/openjdk8 failed to build on aarch6 431. Apr 1 pkg-fallout@FreeBSD [package - main-arm64-default][java/openjdk17] Faile 432. Apr 1 pkg-fallout@FreeBSD [package - 130arm64-default][java/openjdk17-jre] Fai 433. Apr 1 pkg-fallout@FreeBSD [package - main-arm64-default][java/openjdk13] Faile 434. Mar 31 pkg-fallout@FreeBSD [package - 130arm64-default][java/openjdk17] Failed 435. Mar 31 pkg-fallout@FreeBSD [package - 130arm64-default][java/openjdk13] Failed 436. Mar 30 =?UTF-8?Q?S=c3=a9rg java/openjdk18: Add support 437. Mar 28 pkg-fallout@FreeBSD [package - main-arm64-default][java/openjdk17-jre] F 438. Mar 28 pkg-fallout@FreeBSD [package - 130arm64-quarterly][java/openjdk17] Faile 439. Mar 28 pkg-fallout@FreeBSD [package - 130arm64-quarterly][java/openjdk13] Faile 440. Mar 27 pkg-fallout@FreeBSD [package - 130arm64-default][java/openjdk17-jre] Fai
441. Mar 27 bugzilla-noreply@Fr Problem reports for java@FreeBSD.org that need speci 442. Mar 27 bugzilla-noreply@fr [Bug 260319] java/openjdk11: various segfaults with 443. Mar 27 pkg-fallout@FreeBSD [package - main-arm64-default][java/openjdk17] Faile 444. Mar 27 pkg-fallout@FreeBSD [package - main-arm64-default][java/openjdk13] Faile 445. Mar 27 pkg-fallout@FreeBSD [package - 130arm64-default][java/openjdk17] Failed 446. Mar 26 pkg-fallout@FreeBSD [package - 130arm64-default][java/openjdk13] Failed 447. Mar 26 bugzilla-noreply@fr [Bug 262845] java/openjdk13 java/openjdk14 java/open 448. Mar 26 bugzilla-noreply@fr [Bug 262845] java/openjdk13 java/openjdk14 java/open 449. Mar 26 bugzilla-noreply@fr [Bug 262845] java/openjdk13 java/openjdk14 java/open 450. Mar 26 bugzilla-noreply@fr maintainer-feedback requested: [Bug 262845] java/ope 451. Mar 26 bugzilla-noreply@fr [Bug 262809] java/openjdk11: builtin DTrace support 452. Mar 26 pkg-fallout@FreeBSD [package - 122arm64-quarterly][java/openjdk13] Faile 453. Mar 26 pkg-fallout@FreeBSD [package - 122arm64-quarterly][java/openjdk17] Faile 454. Mar 25 bugzilla-noreply@fr [Bug 262809] java/openjdk11: builtin DTrace support 455. Mar 25 bugzilla-noreply@fr maintainer-feedback requested: [Bug 262809] java/ope 456. Mar 25 pkg-fallout@FreeBSD [package - main-arm64-default][java/openjdk17-jre] F 457. Mar 24 pkg-fallout@FreeBSD [package - main-arm64-default][java/openjdk17] Faile 458. Mar 24 pkg-fallout@FreeBSD [package - main-arm64-default][java/openjdk13] Faile 459. Mar 23 pkg-fallout@FreeBSD [package - 130arm64-default][java/openjdk17-jre] Fai 460. Mar 22 pkg-fallout@FreeBSD [package - 130arm64-default][java/openjdk17] Failed
461. Mar 22 pkg-fallout@FreeBSD [package - 130arm64-default][java/openjdk13] Failed 462. Mar 22 pkg-fallout@FreeBSD [package - main-arm64-default][java/openjdk17-jre] F 463. Mar 22 pkg-fallout@FreeBSD [package - main-arm64-default][java/openjdk17] Faile 464. Mar 22 pkg-fallout@FreeBSD [package - main-arm64-default][java/openjdk13] Faile 465. Mar 21 pkg-fallout@FreeBSD [package - 130arm64-quarterly][java/openjdk17] Faile 466. Mar 21 pkg-fallout@FreeBSD [package - 130arm64-quarterly][java/openjdk13] Faile 467. Mar 20 bugzilla-noreply@Fr Problem reports for java@FreeBSD.org that need speci 468. Mar 20 bugzilla-noreply@fr [Bug 262681] java/openjdk8 failed to build on aarch6 469. Mar 20 bugzilla-noreply@fr maintainer-feedback requested: [Bug 262681] java/ope 470. Mar 20 pkg-fallout@FreeBSD [package - 130arm64-default][java/openjdk17-jre] Fai 471. Mar 20 pkg-fallout@FreeBSD [package - main-arm64-default][java/openjdk17-jre] F 472. Mar 20 pkg-fallout@FreeBSD [package - 130arm64-default][java/openjdk17] Failed 473. Mar 20 pkg-fallout@FreeBSD [package - 130arm64-default][java/openjdk13] Failed 474. Mar 20 pkg-fallout@FreeBSD [package - main-arm64-default][java/openjdk13] Faile 475. Mar 20 pkg-fallout@FreeBSD [package - main-arm64-default][java/openjdk17] Faile 476. Mar 19 pkg-fallout@FreeBSD [package - 122amd64-quarterly][java/cos] Failed for 477. Mar 18 pkg-fallout@FreeBSD [package - 130arm64-default][java/openjdk17-jre] Fai 478. Mar 17 pkg-fallout@FreeBSD [package - 130arm64-default][java/openjdk17] Failed 479. Mar 17 pkg-fallout@FreeBSD [package - 130arm64-default][java/openjdk13] Failed 480. Mar 15 bugzilla-noreply@fr [Bug 262071] java/openjdk8: Fails to fetch on 2022Q1
481. Mar 13 bugzilla-noreply@Fr Problem reports for java@FreeBSD.org that need speci 482. Mar 11 James Wright java/intellij: patch review / approval 483. Mar 6 bugzilla-noreply@Fr Problem reports for java@FreeBSD.org that need speci 484. Mar 1 bugzilla-noreply@fr [Bug 259466] java/icedtea-web: Update to 1.8.8 485. Feb 27 bugzilla-noreply@Fr Problem reports for java@FreeBSD.org that need speci 486. Feb 22 pkg-fallout@FreeBSD [package - 130amd64-default][java/cos] Failed for co 487. Feb 22 pkg-fallout@FreeBSD [package - 130i386-default][java/cos] Failed for cos 488. Feb 22 pkg-fallout@FreeBSD [package - main-amd64-default][java/cos] Failed for 489. Feb 22 pkg-fallout@FreeBSD [package - main-i386-default][java/cos] Failed for c 490. Feb 22 bugzilla-noreply@fr [Bug 262071] java/openjdk8: Fails to fetch on 2022Q1 491. Feb 22 bugzilla-noreply@fr [Bug 262071] java/openjdk8: Fails to fetch on 2022Q1 492. Feb 20 bugzilla-noreply@Fr Problem reports for java@FreeBSD.org that need speci 493. Feb 20 bugzilla-noreply@fr [Bug 262071] java/openjdk8: fails to fetch on 2022Q1 494. Feb 20 bugzilla-noreply@fr maintainer-feedback requested: [Bug 262071] java/ope 495. Feb 14 portscout@FreeBSD.o FreeBSD ports you maintain which are out of date 496. Feb 13 bugzilla-noreply@Fr Problem reports for java@FreeBSD.org that need speci 497. Feb 12 bugzilla-noreply@fr [Bug 260319] java/openjdk11: various segfaults with 498. Feb 12 bugzilla-noreply@fr [Bug 260319] java/openjdk11: various segfaults with 499. Feb 10 bugzilla-noreply@fr [Bug 260319] java/openjdk11: various segfaults with 500. Feb 9 bugzilla-noreply@fr [Bug 260319] java/openjdk11: various segfaults with
501. Feb 9 bugzilla-noreply@fr [Bug 260319] java/openjdk11: various segfaults with 502. Feb 9 bugzilla-noreply@fr [Bug 260319] java/openjdk11: various segfaults with 503. Feb 9 bugzilla-noreply@fr [Bug 260319] java/openjdk11: various segfaults with 504. Feb 8 bugzilla-noreply@fr [Bug 260319] java/openjdk11: various segfaults with 505. Feb 8 bugzilla-noreply@fr [Bug 260319] java/openjdk11: various segfaults with 506. Feb 8 bugzilla-noreply@fr [Bug 260319] java/openjdk11: various segfaults with 507. Feb 8 portscout@FreeBSD.o FreeBSD ports you maintain which are out of date 508. Feb 8 bugzilla-noreply@fr [Bug 260319] java/openjdk11: various segfaults with 509. Feb 8 bugzilla-noreply@fr [Bug 260319] java/openjdk11: various segfaults with 510. Feb 8 bugzilla-noreply@fr [Bug 260319] java/openjdk11: various segfaults with 511. Feb 8 bugzilla-noreply@fr [Bug 260319] java/openjdk11: various segfaults with 512. Feb 8 bugzilla-noreply@fr [Bug 260319] java/openjdk11: various segfaults with 513. Feb 6 bugzilla-noreply@Fr Problem reports for java@FreeBSD.org that need speci 514. Feb 6 bugzilla-noreply@fr [Bug 261669] java core dump on pycharm pro 515. Feb 6 bugzilla-noreply@fr [Bug 261669] java core dump on pycharm pro 516. Feb 3 bugzilla-noreply@fr [Bug 261669] java core dump on pycharm pro 517. Jan 31 bugzilla-noreply@fr [Bug 260872] java/openjdk8: segfaults on aarch64 518. Jan 30 bugzilla-noreply@Fr Problem reports for java@FreeBSD.org that need speci 519. Jan 27 bugzilla-noreply@fr [Bug 260872] java/openjdk8: segfaults on aarch64 520. Jan 27 Ronald Klop Re: openjdk8 crash on aarch64; guarantee(val < (1
521. Jan 27 Ronald Klop openjdk8 crash on aarch64; guarantee(val < (1U &l 522. Jan 23 Larry Rosenman Re: java/openjdk11: failure on recent current 523. Jan 23 Greg Lewis Re: java/openjdk11: failure on recent current 524. Jan 23 bugzilla-noreply@Fr Problem reports for java@FreeBSD.org that need speci 525. Jan 22 Larry Rosenman java/openjdk11: failure on recent current 526. Jan 20 bugzilla-noreply@fr [Bug 260187] java/bootstrap-openjdk17: broken on aar 527. Jan 19 bugzilla-noreply@fr [Bug 260187] java/bootstrap-openjdk17: broken on aar 528. Jan 18 bugzilla-noreply@fr [Bug 260872] java/openjdk8: segfaults on aarch64 529. Jan 18 bugzilla-noreply@fr [Bug 260872] java/openjdk8: 530. Jan 17 bugzilla-noreply@fr [Bug 260872] java/openjdk8: 531. Jan 16 bugzilla-noreply@Fr Problem reports for java@FreeBSD.org that need speci 532. Jan 12 bugzilla-noreply@fr [Bug 260872] java/openjdk8: 533. Jan 10 bugzilla-noreply@fr [Bug 260319] java/openjdk11: various segfaults with 534. Jan 10 bugzilla-noreply@fr [Bug 260319] java/openjdk11: various segfaults with 535. Jan 10 bugzilla-noreply@fr [Bug 260319] java/openjdk11: various segfaults with 536. Jan 9 bugzilla-noreply@Fr Problem reports for java@FreeBSD.org that need speci 537. Jan 2 bugzilla-noreply@Fr Problem reports for java@FreeBSD.org that need speci 538. Jan 2 bugzilla-noreply@fr maintainer-feedback requested: [Bug 260872] java/ope 539. Jan 2 bugzilla-noreply@fr [Bug 260872] java/openjdk8: 540. Dec 30 pkg-fallout@FreeBSD [package - main-amd64-default][java/openjdk11-jre] F
541. Dec 30 pkg-fallout@FreeBSD [package - main-i386-default][java/openjdk11-jre] Fa 542. Dec 30 pkg-fallout@FreeBSD [package - main-amd64-default][java/openjdk17] Faile 543. Dec 30 pkg-fallout@FreeBSD [package - main-amd64-default][java/openjdk11] Faile 544. Dec 30 pkg-fallout@FreeBSD [package - main-amd64-default][java/openjdk12] Faile 545. Dec 30 pkg-fallout@FreeBSD [package - main-i386-default][java/openjdk12] Failed 546. Dec 30 pkg-fallout@FreeBSD [package - main-i386-default][java/openjdk11] Failed 547. Dec 29 bugzilla-noreply@fr [Bug 260319] java/openjdk11: various segfaults with 548. Dec 29 bugzilla-noreply@fr [Bug 260319] java/openjdk11: various segfaults with 549. Dec 29 bugzilla-noreply@fr [Bug 260319] java/openjdk11: various segfaults with 550. Dec 29 bugzilla-noreply@fr [Bug 260319] java/openjdk11: various segfaults with 551. Dec 29 bugzilla-noreply@fr [Bug 260319] java/openjdk11: various segfaults with 552. Dec 29 bugzilla-noreply@fr [Bug 260187] java/bootstrap-openjdk17: broken on aar 553. Dec 27 bugzilla-noreply@fr [Bug 245188] devel/artifactory: Fails to start with 554. Dec 26 bugzilla-noreply@Fr Problem reports for java@FreeBSD.org that need speci 555. Dec 26 bugzilla-noreply@fr [Bug 260319] java/openjdk11: various segfaults with 556. Dec 22 bugzilla-noreply@fr [Bug 260319] java/openjdk11: various segfaults with 557. Dec 22 bugzilla-noreply@fr [Bug 260319] java/openjdk11: various segfaults with 558. Dec 22 bugzilla-noreply@fr [Bug 260319] java/openjdk11: various segfaults with 559. Dec 20 bugzilla-noreply@fr [Bug 260319] java/openjdk11: various segfaults with 560. Dec 20 Jonathan Chen Re: clang-13 built java/openjdk11 on recent stable/1
561. Dec 20 Jonathan Chen clang-13 built java/openjdk11 on recent stable/12 562. Dec 19 bugzilla-noreply@Fr Problem reports for java@FreeBSD.org that need speci 563. Dec 13 portscout@FreeBSD.o FreeBSD ports you maintain which are out of date 564. Dec 12 bugzilla-noreply@Fr Problem reports for java@FreeBSD.org that need speci 565. Dec 10 bugzilla-noreply@fr [Bug 259466] java/icedtea-web: Update to 1.8.8 566. Dec 10 bugzilla-noreply@fr [Bug 259466] java/icedtea-web: Update to 1.8.7 567. Dec 10 bugzilla-noreply@fr [Bug 260319] java/openjdk11: various segfaults with 568. Dec 10 bugzilla-noreply@fr maintainer-feedback requested: [Bug 260319] java/ope 569. Dec 7 bugzilla-noreply@fr [Bug 260187] java/bootstrap-openjdk17: broken on aar 570. Dec 7 bugzilla-noreply@fr [Bug 260187] java/bootstrap-openjdk17: broken on aar 571. Dec 5 bugzilla-noreply@Fr Problem reports for java@FreeBSD.org that need speci 572. Dec 3 bugzilla-noreply@fr [Bug 260187] java/bootstrap-openjdk17: broken on aar 573. Dec 3 bugzilla-noreply@fr [Bug 260187] java/bootstrap-openjdk17: broken on aar 574. Dec 3 bugzilla-noreply@fr maintainer-feedback requested: [Bug 260187] java/boo 575. Nov 28 bugzilla-noreply@Fr Problem reports for java@FreeBSD.org that need speci


Up | Home | Archive Sorted by: Subject | Author | Date | Reverse Date
Contact us
Last update: Sat Jul 2 16:28:55 2022
Created by mailindex 1.1
Copyright © 1995-2017 FreeBSD Project.
All rights reserved.